OCamllabs icon Home|Differences with the last checks|Previous runs


Building on odawa

(from windows-server-2022-amd64-ocaml-5.3)
2025-03-26 00:05.04 ---> using "1d6ffeb5a52124df73b2e951323e99615c52ca4f9bdf0f65039be6146fabdaab" from cache

/: (user (uid 1000) (gid 1000))

/: (env OPAMPRECISETRACKING 1)

/: (env OPAMUTF8 never)

/: (env OPAMEXTERNALSOLVER builtin-0install)

/: (env OPAMCRITERIA +removed)

/: (env CI true)

/: (env OPAM_HEALTH_CHECK_CI true)

/: (run (shell "ln -f /usr/bin/opam-dev.exe /usr/bin/opam.exe"))
2025-03-26 00:05.04 ---> using "75bf3fbea1cbc65a9803f40104651d67c546cddf5606f6a4af6db8fca92eb5c0" from cache

/: (run (network host)
        (shell "rm -rf ~/opam-repository && git clone -q 'https://github.com/ocaml/opam-repository' ~/opam-repository && git -C ~/opam-repository checkout -q 48e47466f5898fbf475b71788bcf587634373afa"))
2025-03-26 00:05.04 ---> using "44557a8a04bf792ce396575553e915042808e44424223ad61bfcaf5173b323b2" from cache

/: (run (shell "rm -rf ~/.opam && opam init -ya --bare ~/opam-repository"))

User configuration:
  Updating ~\.bash_profile.
[NOTE] Make sure that ~\.bash_profile is well sourced in your ~/.bashrc.

  Added 9 lines after line 1 in ~\.bash_profile.
2025-03-26 00:05.04 ---> using "ccee0b836da7b8bc38a43a3d4f9ec4673c6391b7f12345649a2720dba9a9ca90" from cache

/: (run (cache (opam-archives (target "c:\\Users\\opam\\AppData\\Local\\opam\\download-cache")))
        (network host)
        (shell "opam switch create --repositories=default '5.3' '5.3.0'"))

<><> Installing new switch packages <><><><><><><><><><><><><><><><><><><><><><>
Switch invariant: ["ocaml-base-compiler" {= "5.3.0"} | "ocaml-system" {= "5.3.0"}]

<><> Processing actions <><><><><><><><><><><><><><><><><><><><><><><><><><><><>
-> installed arch-x86_64.1
-> installed base-bigarray.base
-> installed base-threads.base
-> installed base-unix.base
-> installed host-arch-x86_64.1
-> installed host-system-mingw.1
-> retrieved flexdll.0.43  (cached)
-> retrieved ocaml-config.3  (cached)
-> installed flexdll.0.43
-> installed ocaml-options-vanilla.1
-> retrieved mingw-w64-shims.0.2.0  (cached)
-> installed conf-mingw-w64-gcc-x86_64.1
-> installed ocaml-env-mingw64.1
-> installed system-mingw.1
-> retrieved ocaml-compiler.5.3.0  (cached)
-> installed mingw-w64-shims.0.2.0
-> installed ocaml-compiler.5.3.0
-> installed ocaml-base-compiler.5.3.0
-> installed ocaml-config.3
-> installed ocaml.5.3.0
-> installed base-domains.base
-> installed base-effects.base
-> installed base-nnp.base
Done.
# To update the current shell environment, run: eval $(opam env --switch=5.3)
2025-03-26 00:05.04 ---> using "ef56a23ef5f64f73f7e4863324c777dd223d9336ad4642cb1e69a2aff98c8b3e" from cache

/: (run (network host)
        (shell "opam update --depexts"))
2025-03-26 00:05.04 ---> using "5782aeb2a99a94a0e83c752b797126b93ecac28df17c02fca786b1a36ec6aa34" from cache

/: (run (cache (opam-archives (target "c:\\Users\\opam\\AppData\\Local\\opam\\download-cache")))
        (network host)
        (shell  "opam remove -y shuttle_websocket.0.12.0\
               \nopam install -vy shuttle_websocket.0.12.0\
               \nres=$?\
               \nif [ $res = 31 ]; then\
               \n    if opam show -f x-ci-accept-failures: shuttle_websocket.0.12.0 | grep -q 'windows-server-2022-amd64-ocaml-5.3'; then\
               \n        echo \"This package failed and has been disabled for CI using the 'x-ci-accept-failures' field.\"\
               \n        exit 69\
               \n    fi\
               \nfi \
               \n\
               \n\
               \nexit $res"))
Nothing to do.
[NOTE] shuttle_websocket.0.12.0 is not installed.

The following actions will be performed:
=== recompile 1 package
  - recompile mingw-w64-shims               0.2.0     [uses conf-mingw-w64-gcc-i686]
=== install 117 packages
  - install   async                         v0.17.0   [required by async_websocket, shuttle_http]
  - install   async_kernel                  v0.17.0   [required by async]
  - install   async_log                     v0.17.0   [required by shuttle_http]
  - install   async_rpc_kernel              v0.17.0   [required by async]
  - install   async_ssl                     v0.17.0-1 [required by shuttle_http]
  - install   async_unix                    v0.17.0   [required by async]
  - install   async_websocket               v0.17.0   [required by shuttle_websocket]
  - install   base                          v0.17.1   [required by async_ssl, jane_rope]
  - install   base_bigstring                v0.17.0   [required by core]
  - install   base_quickcheck               v0.17.0   [required by core]
  - install   bigarray-compat               1.1.0     [required by ctypes]
  - install   bin_prot                      v0.17.0   [required by core]
  - install   capitalization                v0.17.0   [required by ppx_string_conv]
  - install   conf-g++                      1.0       [required by re2]
  - install   conf-gmp                      4         [required by conf-gmp-powm-sec, zarith]
  - install   conf-gmp-powm-sec             3         [required by cryptokit]
  - install   conf-libffi                   2.0.0     [required by ctypes-foreign]
  - install   conf-libssl                   4         [required by async_ssl]
  - install   conf-mingw-w64-g++-i686       1         [required by conf-g++]
  - install   conf-mingw-w64-g++-x86_64     1         [required by conf-g++]
  - install   conf-mingw-w64-gcc-i686       1         [required by conf-mingw-w64-zlib-i686, conf-mingw-w64-openssl-i686]
  - install   conf-mingw-w64-gmp-i686       1         [required by conf-gmp]
  - install   conf-mingw-w64-gmp-x86_64     1         [required by conf-gmp]
  - install   conf-mingw-w64-libffi-i686    1         [required by conf-libffi]
  - install   conf-mingw-w64-libffi-x86_64  1         [required by conf-libffi]
  - install   conf-mingw-w64-openssl-i686   1         [required by conf-libssl]
  - install   conf-mingw-w64-openssl-x86_64 1         [required by conf-libssl]
  - install   conf-mingw-w64-zlib-i686      1         [required by conf-zlib]
  - install   conf-mingw-w64-zlib-x86_64    1         [required by conf-zlib]
  - install   conf-pkg-config               3         [required by conf-libssl, conf-zlib, zarith, ctypes-foreign]
  - install   conf-zlib                     1         [required by cryptokit]
  - install   core                          v0.17.1   [required by shuttle_http]
  - install   core_kernel                   v0.17.0   [required by async_websocket]
  - install   core_unix                     v0.17.0   [required by async]
  - install   cryptokit                     1.16.1    [required by async_websocket]
  - install   csexp                         1.5.2     [required by dune-configurator]
  - install   cstruct                       6.2.0     [required by async_unix]
  - install   ctypes                        0.23.0    [required by async_ssl]
  - install   ctypes-foreign                0.23.0    [required by async_ssl]
  - install   dune                          3.17.1    [required by shuttle_websocket]
  - install   dune-configurator             3.17.1    [required by cryptokit, async_ssl]
  - install   expect_test_helpers_core      v0.17.0   [required by core_unix]
  - install   fieldslib                     v0.17.0   [required by core]
  - install   fmt                           0.9.0     [required by cstruct]
  - install   gel                           v0.17.0   [required by async_rpc_kernel]
  - install   int_repr                      v0.17.0   [required by core_kernel]
  - install   integers                      0.7.0     [required by ctypes]
  - install   jane-street-headers           v0.17.0   [required by core]
  - install   jane_rope                     v0.17.0   [required by shuttle_http]
  - install   jst-config                    v0.17.0   [required by core]
  - install   num                           1.5-1     [required by sexplib]
  - install   ocaml-compiler-libs           v0.17.0   [required by ppxlib]
  - install   ocaml_intrinsics_kernel       v0.17.1   [required by base]
  - install   ocamlbuild                    0.15.0    [required by uutf]
  - install   ocamlfind                     1.9.5     [required by zarith]
  - install   parsexp                       v0.17.0   [required by sexplib]
  - install   ppx_assert                    v0.17.0   [required by core]
  - install   ppx_base                      v0.17.0   [required by core]
  - install   ppx_bench                     v0.17.0   [required by ppx_jane]
  - install   ppx_bin_prot                  v0.17.0   [required by ppx_jane]
  - install   ppx_cold                      v0.17.0   [required by ppx_base]
  - install   ppx_compare                   v0.17.0   [required by ppx_diff]
  - install   ppx_custom_printf             v0.17.0   [required by ppx_jane]
  - install   ppx_derivers                  1.2.1     [required by ppxlib]
  - install   ppx_diff                      v0.17.0   [required by core]
  - install   ppx_disable_unused_warnings   v0.17.0   [required by ppx_jane]
  - install   ppx_enumerate                 v0.17.0   [required by ppx_diff]
  - install   ppx_expect                    v0.17.2   [required by ppx_jane]
  - install   ppx_fields_conv               v0.17.0   [required by ppx_jane]
  - install   ppx_fixed_literal             v0.17.0   [required by ppx_jane]
  - install   ppx_globalize                 v0.17.0   [required by ppx_base]
  - install   ppx_hash                      v0.17.0   [required by core]
  - install   ppx_here                      v0.17.0   [required by ppx_jane]
  - install   ppx_ignore_instrumentation    v0.17.0   [required by ppx_jane]
  - install   ppx_inline_test               v0.17.0   [required by core]
  - install   ppx_jane                      v0.17.0   [required by async_websocket, shuttle_http]
  - install   ppx_let                       v0.17.0   [required by ppx_jane]
  - install   ppx_log                       v0.17.0   [required by ppx_jane]
  - install   ppx_module_timer              v0.17.0   [required by ppx_jane]
  - install   ppx_optcomp                   v0.17.0   [required by async_ssl]
  - install   ppx_optional                  v0.17.0   [required by ppx_jane]
  - install   ppx_pipebang                  v0.17.0   [required by ppx_jane]
  - install   ppx_sexp_conv                 v0.17.0   [required by core]
  - install   ppx_sexp_message              v0.17.0   [required by core]
  - install   ppx_sexp_value                v0.17.0   [required by ppx_jane]
  - install   ppx_stable                    v0.17.0   [required by ppx_jane]
  - install   ppx_stable_witness            v0.17.0   [required by ppx_jane]
  - install   ppx_string                    v0.17.0   [required by ppx_jane]
  - install   ppx_string_conv               v0.17.0   [required by ppx_jane]
  - install   ppx_tydi                      v0.17.0   [required by ppx_jane]
  - install   ppx_typerep_conv              v0.17.0   [required by ppx_jane]
  - install   ppx_variants_conv             v0.17.0   [required by ppx_jane]
  - install   ppxlib                        0.34.0    [required by ppx_diff]
  - install   ppxlib_jane                   v0.17.2   [required by ppx_diff]
  - install   protocol_version_header       v0.17.0   [required by async_rpc_kernel]
  - install   re                            1.12.0    [required by expect_test_helpers_core]
  - install   re2                           v0.17.0   [required by shuttle_http]
  - install   regex_parser_intf             v0.17.0   [required by re2]
  - install   seq                           base      [required by re]
  - install   sexp_pretty                   v0.17.0   [required by expect_test_helpers_core]
  - install   sexplib                       v0.17.0   [required by core]
  - install   sexplib0                      v0.17.0   [required by base]
  - install   shuttle_http                  0.12.0    [required by shuttle_websocket]
  - install   shuttle_websocket             0.12.0
  - install   spawn                         v0.17.0   [required by core_unix]
  - install   splittable_random             v0.17.0   [required by core]
  - install   stdio                         v0.17.0   [required by async_ssl]
  - install   stdlib-shims                  0.3.0     [required by integers]
  - install   textutils                     v0.17.0   [required by async]
  - install   time_now                      v0.17.0   [required by core]
  - install   timezone                      v0.17.0   [required by async_log]
  - install   topkg                         1.0.7     [required by uutf]
  - install   typerep                       v0.17.1   [required by core]
  - install   uopt                          v0.17.0   [required by core_kernel]
  - install   uutf                          1.0.3     [required by textutils]
  - install   variantslib                   v0.17.0   [required by core]
  - install   zarith                        1.14      [required by cryptokit]

The following system packages will first need to be installed:
    mingw64-i686-gcc-core mingw64-i686-gcc-g++ mingw64-i686-gmp mingw64-i686-libffi mingw64-i686-openssl mingw64-i686-zlib mingw64-x86_64-gcc-g++ mingw64-x86_64-gmp mingw64-x86_64-libffi mingw64-x86_64-openssl mingw64-x86_64-zlib

<><> Handling external dependencies <><><><><><><><><><><><><><><><><><><><><><>

opam believes some required external dependencies are missing. opam can:
> 1. Run C:\Users\opam\AppData\Local\opam\.cygwin\setup-x86_64.exe to install them (may need root/sudo access)
  2. Display the recommended C:\Users\opam\AppData\Local\opam\.cygwin\setup-x86_64.exe command and wait while you run it manually (e.g. in another terminal)
  3. Continue anyway, and, upon success, permanently register that this external dependency is present, but not detectable
  4. Abort the installation

[1/2/3/4] 1

+ C:\Users\opam\AppData\Local\opam\.cygwin\setup-x86_64.exe "--root" "C:\\cygwin64" "--quiet-mode" "unattended" "--no-shortcuts" "--no-startmenu" "--no-desktop" "--no-admin" "--no-version-check" "--no-write-registry" "--packages" "mingw64-i686-gcc-core,mingw64-i686-gcc-g++,mingw64-i686-gmp,mingw64-i686-libffi,mingw64-i686-openssl,mingw64-i686-zlib,mingw64-x86_64-gcc-g++,mingw64-x86_64-gmp,mingw64-x86_64-libffi,mingw64-x86_64-openssl,mingw64-x86_64-zlib"
- Starting cygwin install, version 2.932
- User has backup/restore rights
- User has symlink creation right
- Current Directory: C:\Windows\system32
- root: C:\cygwin64 system
- Changing gid to Administrators
- Selected local directory: C:\Windows\system32
- net: Preconfig
- site: https://cygwin.mirror.constant.com/
- solving: 11 tasks, update: no, use test packages: no
- solving: 16 tasks, update: no, use test packages: no
- Augmented Transaction List:
-    0 install mingw64-i686-binutils                 2.44-1   
-    1 install mingw64-i686-libffi                   3.2.1-1  
-    2 install mingw64-i686-windows-default-manifest 6.4-1    
-    3 install mingw64-i686-winpthreads              12.0.0-1 
-    4 install mingw64-i686-zlib                     1.3.1-1  
-    5 install mingw64-x86_64-gcc-g++                12.4.0-1 
-    6 install mingw64-x86_64-libffi                 3.2.1-2  
-    7 install mingw64-x86_64-zlib                   1.3.1-1  
-    8 install mingw64-i686-headers                  12.0.0-1 
-    9 install mingw64-i686-openssl                  3.0.16-1 
-   10 install mingw64-x86_64-gmp                    6.3.0-1  
-   11 install mingw64-x86_64-openssl                3.0.16-1 
-   12 install mingw64-i686-runtime                  12.0.0-1 
-   13 install mingw64-i686-gcc-core                 12.4.0-1 
-   14 install mingw64-i686-gcc-g++                  12.4.0-1 
-   15 install mingw64-i686-gmp                      6.3.0-1  
- Downloaded C:\Windows\system32/https%3a%2f%2fcygwin.mirror.constant.com%2f/x86_64/release/mingw64-i686-binutils/mingw64-i686-binutils-2.44-1.tar.zst
- Downloaded C:\Windows\system32/https%3a%2f%2fcygwin.mirror.constant.com%2f/noarch/release/mingw64-i686-libffi/mingw64-i686-libffi-3.2.1-1.tar.xz
- Downloaded C:\Windows\system32/https%3a%2f%2fcygwin.mirror.constant.com%2f/noarch/release/mingw64-i686-windows-default-manifest/mingw64-i686-windows-default-manifest-6.4-1.tar.xz
- Downloaded C:\Windows\system32/https%3a%2f%2fcygwin.mirror.constant.com%2f/noarch/release/mingw64-i686-winpthreads/mingw64-i686-winpthreads-12.0.0-1.tar.xz
- Downloaded C:\Windows\system32/https%3a%2f%2fcygwin.mirror.constant.com%2f/noarch/release/mingw64-i686-zlib/mingw64-i686-zlib-1.3.1-1.tar.zst
- Downloaded C:\Windows\system32/https%3a%2f%2fcygwin.mirror.constant.com%2f/x86_64/release/mingw64-x86_64-gcc/mingw64-x86_64-gcc-g++/mingw64-x86_64-gcc-g++-12.4.0-1.tar.zst
- Downloaded C:\Windows\system32/https%3a%2f%2fcygwin.mirror.constant.com%2f/noarch/release/mingw64-x86_64-libffi/mingw64-x86_64-libffi-3.2.1-2.tar.xz
- Downloaded C:\Windows\system32/https%3a%2f%2fcygwin.mirror.constant.com%2f/noarch/release/mingw64-x86_64-zlib/mingw64-x86_64-zlib-1.3.1-1.tar.zst
- Downloaded C:\Windows\system32/https%3a%2f%2fcygwin.mirror.constant.com%2f/noarch/release/mingw64-i686-headers/mingw64-i686-headers-12.0.0-1.tar.xz
- Downloaded C:\Windows\system32/https%3a%2f%2fcygwin.mirror.constant.com%2f/noarch/release/mingw64-i686-openssl/mingw64-i686-openssl-3.0.16-1.tar.zst
- Downloaded C:\Windows\system32/https%3a%2f%2fcygwin.mirror.constant.com%2f/noarch/release/mingw64-x86_64-gmp/mingw64-x86_64-gmp-6.3.0-1.tar.zst
- Downloaded C:\Windows\system32/https%3a%2f%2fcygwin.mirror.constant.com%2f/noarch/release/mingw64-x86_64-openssl/mingw64-x86_64-openssl-3.0.16-1.tar.zst
- Downloaded C:\Windows\system32/https%3a%2f%2fcygwin.mirror.constant.com%2f/noarch/release/mingw64-i686-runtime/mingw64-i686-runtime-12.0.0-1.tar.xz
- Downloaded C:\Windows\system32/https%3a%2f%2fcygwin.mirror.constant.com%2f/x86_64/release/mingw64-i686-gcc/mingw64-i686-gcc-core/mingw64-i686-gcc-core-12.4.0-1.tar.zst
- Downloaded C:\Windows\system32/https%3a%2f%2fcygwin.mirror.constant.com%2f/x86_64/release/mingw64-i686-gcc/mingw64-i686-gcc-g++/mingw64-i686-gcc-g++-12.4.0-1.tar.zst
- Downloaded C:\Windows\system32/https%3a%2f%2fcygwin.mirror.constant.com%2f/noarch/release/mingw64-i686-gmp/mingw64-i686-gmp-6.3.0-1.tar.zst
- Extracting from file://C:\Windows\system32/https%3a%2f%2fcygwin.mirror.constant.com%2f/x86_64/release/mingw64-i686-binutils/mingw64-i686-binutils-2.44-1.tar.zst
- Extracting from file://C:\Windows\system32/https%3a%2f%2fcygwin.mirror.constant.com%2f/noarch/release/mingw64-i686-libffi/mingw64-i686-libffi-3.2.1-1.tar.xz
- Extracting from file://C:\Windows\system32/https%3a%2f%2fcygwin.mirror.constant.com%2f/noarch/release/mingw64-i686-windows-default-manifest/mingw64-i686-windows-default-manifest-6.4-1.tar.xz
- Extracting from file://C:\Windows\system32/https%3a%2f%2fcygwin.mirror.constant.com%2f/noarch/release/mingw64-i686-winpthreads/mingw64-i686-winpthreads-12.0.0-1.tar.xz
- Extracting from file://C:\Windows\system32/https%3a%2f%2fcygwin.mirror.constant.com%2f/noarch/release/mingw64-i686-zlib/mingw64-i686-zlib-1.3.1-1.tar.zst
- Extracting from file://C:\Windows\system32/https%3a%2f%2fcygwin.mirror.constant.com%2f/x86_64/release/mingw64-x86_64-gcc/mingw64-x86_64-gcc-g++/mingw64-x86_64-gcc-g++-12.4.0-1.tar.zst
- Extracting from file://C:\Windows\system32/https%3a%2f%2fcygwin.mirror.constant.com%2f/noarch/release/mingw64-x86_64-libffi/mingw64-x86_64-libffi-3.2.1-2.tar.xz
- Extracting from file://C:\Windows\system32/https%3a%2f%2fcygwin.mirror.constant.com%2f/noarch/release/mingw64-x86_64-zlib/mingw64-x86_64-zlib-1.3.1-1.tar.zst
- Extracting from file://C:\Windows\system32/https%3a%2f%2fcygwin.mirror.constant.com%2f/noarch/release/mingw64-i686-headers/mingw64-i686-headers-12.0.0-1.tar.xz
- Extracting from file://C:\Windows\system32/https%3a%2f%2fcygwin.mirror.constant.com%2f/noarch/release/mingw64-i686-openssl/mingw64-i686-openssl-3.0.16-1.tar.zst
- Extracting from file://C:\Windows\system32/https%3a%2f%2fcygwin.mirror.constant.com%2f/noarch/release/mingw64-x86_64-gmp/mingw64-x86_64-gmp-6.3.0-1.tar.zst
- Extracting from file://C:\Windows\system32/https%3a%2f%2fcygwin.mirror.constant.com%2f/noarch/release/mingw64-x86_64-openssl/mingw64-x86_64-openssl-3.0.16-1.tar.zst
- Extracting from file://C:\Windows\system32/https%3a%2f%2fcygwin.mirror.constant.com%2f/noarch/release/mingw64-i686-runtime/mingw64-i686-runtime-12.0.0-1.tar.xz
- Extracting from file://C:\Windows\system32/https%3a%2f%2fcygwin.mirror.constant.com%2f/x86_64/release/mingw64-i686-gcc/mingw64-i686-gcc-core/mingw64-i686-gcc-core-12.4.0-1.tar.zst
- Extracting from file://C:\Windows\system32/https%3a%2f%2fcygwin.mirror.constant.com%2f/x86_64/release/mingw64-i686-gcc/mingw64-i686-gcc-g++/mingw64-i686-gcc-g++-12.4.0-1.tar.zst
- Extracting from file://C:\Windows\system32/https%3a%2f%2fcygwin.mirror.constant.com%2f/noarch/release/mingw64-i686-gmp/mingw64-i686-gmp-6.3.0-1.tar.zst
- running: C:\cygwin64\bin\dash.exe "/etc/postinstall/0p_000_autorebase.dash"
- running: C:\cygwin64\bin\dash.exe "/etc/postinstall/0p_update-info-dir.dash"
- running: C:\cygwin64\bin\dash.exe "/etc/postinstall/zp_man-db-update-index.dash"
- Ending cygwin install
- NOTE: you should run 'diskperf -y' to enable the disk statistics
- NOTE: you should run 'diskperf -y' to enable the disk statistics

<><> Processing actions <><><><><><><><><><><><><><><><><><><><><><><><><><><><>
Processing  1/352: [async.v0.17.0: extract]
Processing  2/352: [async.v0.17.0: extract] [async_kernel.v0.17.0: extract]
Processing  3/352: [async.v0.17.0: extract] [async_kernel.v0.17.0: extract] [async_log.v0.17.0: extract]
-> retrieved async.v0.17.0  (cached)
Processing  3/352: [async_kernel.v0.17.0: extract] [async_log.v0.17.0: extract]
Processing  4/352: [async_kernel.v0.17.0: extract] [async_log.v0.17.0: extract] [async_rpc_kernel.v0.17.0: extract]
-> retrieved async_kernel.v0.17.0  (cached)
Processing  4/352: [async_log.v0.17.0: extract] [async_rpc_kernel.v0.17.0: extract]
Processing  5/352: [async_log.v0.17.0: extract] [async_rpc_kernel.v0.17.0: extract] [async_ssl.v0.17.0-1: http]
-> retrieved async_log.v0.17.0  (cached)
Processing  5/352: [async_rpc_kernel.v0.17.0: extract] [async_ssl.v0.17.0-1: http]
Processing  6/352: [async_rpc_kernel.v0.17.0: extract] [async_ssl.v0.17.0-1: http] [async_unix.v0.17.0: extract]
-> retrieved async_rpc_kernel.v0.17.0  (cached)
Processing  6/352: [async_ssl.v0.17.0-1: http] [async_unix.v0.17.0: extract]
Processing  7/352: [async_ssl.v0.17.0-1: http] [async_unix.v0.17.0: extract] [async_websocket.v0.17.0: http]
-> retrieved async_unix.v0.17.0  (cached)
Processing  7/352: [async_ssl.v0.17.0-1: http] [async_websocket.v0.17.0: http]
Processing  8/352: [async_ssl.v0.17.0-1: http] [async_websocket.v0.17.0: http] [base.v0.17.1: extract]
Processing  8/352: [async_ssl.v0.17.0-1: extract] [async_websocket.v0.17.0: http] [base.v0.17.1: extract]
Processing  8/352: [async_ssl.v0.17.0-1/no-incompatible-pointer-types-017.patch: dl] [async_websocket.v0.17.0: http] [base.v0.17.1: extract]
-> retrieved base.v0.17.1  (cached)
Processing  8/352: [async_ssl.v0.17.0-1/no-incompatible-pointer-types-017.patch: dl] [async_websocket.v0.17.0: http]
Processing  9/352: [async_ssl.v0.17.0-1/no-incompatible-pointer-types-017.patch: dl] [async_websocket.v0.17.0: http] [base_bigstring.v0.17.0: extract]
-> retrieved async_ssl.v0.17.0-1  (https://github.com/janestreet/async_ssl/archive/refs/tags/v0.17.0.tar.gz)
Processing  9/352: [async_websocket.v0.17.0: http] [base_bigstring.v0.17.0: extract]
Processing 10/352: [async_websocket.v0.17.0: http] [base_bigstring.v0.17.0: extract] [base_quickcheck.v0.17.0: extract]
-> retrieved base_bigstring.v0.17.0  (cached)
Processing 10/352: [async_websocket.v0.17.0: http] [base_quickcheck.v0.17.0: extract]
Processing 11/352: [async_websocket.v0.17.0: http] [base_quickcheck.v0.17.0: extract] [bigarray-compat.1.1.0: extract]
-> retrieved base_quickcheck.v0.17.0  (cached)
Processing 11/352: [async_websocket.v0.17.0: http] [bigarray-compat.1.1.0: extract]
Processing 12/352: [async_websocket.v0.17.0: http] [bigarray-compat.1.1.0: extract] [bin_prot.v0.17.0: extract]
-> retrieved bigarray-compat.1.1.0  (cached)
Processing 12/352: [async_websocket.v0.17.0: http] [bin_prot.v0.17.0: extract]
Processing 13/352: [async_websocket.v0.17.0: http] [bin_prot.v0.17.0: extract] [capitalization.v0.17.0: extract]
-> retrieved bin_prot.v0.17.0  (cached)
Processing 13/352: [async_websocket.v0.17.0: http] [capitalization.v0.17.0: extract]
Processing 14/352: [async_websocket.v0.17.0: http] [capitalization.v0.17.0: extract]
-> retrieved conf-gmp.4  (cached)
Processing 15/352: [async_websocket.v0.17.0: http] [capitalization.v0.17.0: extract]
-> retrieved conf-gmp-powm-sec.3  (cached)
Processing 16/352: [async_websocket.v0.17.0: http] [capitalization.v0.17.0: extract]
Processing 17/352: [async_websocket.v0.17.0: http] [capitalization.v0.17.0: extract]
-> retrieved conf-libssl.4  (cached)
Processing 18/352: [async_websocket.v0.17.0: http] [capitalization.v0.17.0: extract]
Processing 19/352: [async_websocket.v0.17.0: http] [capitalization.v0.17.0: extract]
Processing 20/352: [async_websocket.v0.17.0: http] [capitalization.v0.17.0: extract]
Processing 21/352: [async_websocket.v0.17.0: http] [capitalization.v0.17.0: extract]
Processing 22/352: [async_websocket.v0.17.0: http] [capitalization.v0.17.0: extract]
Processing 23/352: [async_websocket.v0.17.0: http] [capitalization.v0.17.0: extract]
Processing 24/352: [async_websocket.v0.17.0: http] [capitalization.v0.17.0: extract]
Processing 25/352: [async_websocket.v0.17.0: http] [capitalization.v0.17.0: extract]
Processing 26/352: [async_websocket.v0.17.0: http] [capitalization.v0.17.0: extract]
Processing 27/352: [async_websocket.v0.17.0: http] [capitalization.v0.17.0: extract]
Processing 28/352: [async_websocket.v0.17.0: http] [capitalization.v0.17.0: extract]
Processing 29/352: [async_websocket.v0.17.0: http] [capitalization.v0.17.0: extract]
Processing 30/352: [async_websocket.v0.17.0: http] [capitalization.v0.17.0: extract]
Processing 31/352: [async_websocket.v0.17.0: http] [capitalization.v0.17.0: extract]
Processing 32/352: [async_websocket.v0.17.0: http] [capitalization.v0.17.0: extract] [core.v0.17.1: extract]
Processing 33/352: [async_websocket.v0.17.0: http] [capitalization.v0.17.0: extract] [core.v0.17.1: extract] [conf-mingw-w64-g++-x86_64: x86_64-w64-mingw32-g++]
Processing 34/352: [async_websocket.v0.17.0: http] [capitalization.v0.17.0: extract] [core.v0.17.1: extract] [conf-mingw-w64-g++-x86_64: x86_64-w64-mingw32-g++] [conf-mingw-w64-gcc-i686: i686-w64-mingw32-gcc]
Processing 35/352: [async_websocket.v0.17.0: http] [capitalization.v0.17.0: extract] [core.v0.17.1: extract] [conf-mingw-w64-g++-x86_64: x86_64-w64-mingw32-g++] [conf-mingw-w64-gcc-i686: i686-w64-mingw32-gcc] [conf-pkg-config: pkgconf]
-> retrieved capitalization.v0.17.0  (cached)
Processing 35/352: [async_websocket.v0.17.0: http] [core.v0.17.1: extract] [conf-mingw-w64-g++-x86_64: x86_64-w64-mingw32-g++] [conf-mingw-w64-gcc-i686: i686-w64-mingw32-gcc] [conf-pkg-config: pkgconf]
Processing 36/352: [async_websocket.v0.17.0: http] [core.v0.17.1: extract] [core_kernel.v0.17.0: extract] [conf-mingw-w64-g++-x86_64: x86_64-w64-mingw32-g++] [conf-mingw-w64-gcc-i686: i686-w64-mingw32-gcc] [conf-pkg-config: pkgconf]
+ C:\cygwin64\bin\x86_64-w64-mingw32-g++.exe "--version" (CWD=C:\Users\opam\AppData\Local\opam\5.3\.opam-switch\build\conf-mingw-w64-g++-x86_64.1)
- x86_64-w64-mingw32-g++ (GCC) 12.4.0
- Copyright (C) 2022 Free Software Foundation, Inc.
- This is free software; see the source for copying conditions.  There is NO
- warranty; not even for MERCHANTABILITY or FITNESS FOR A PARTICULAR PURPOSE.
- 
-> compiled  conf-mingw-w64-g++-x86_64.1
Processing 36/352: [async_websocket.v0.17.0: http] [core.v0.17.1: extract] [core_kernel.v0.17.0: extract] [conf-mingw-w64-gcc-i686: i686-w64-mingw32-gcc] [conf-pkg-config: pkgconf]
-> installed conf-mingw-w64-g++-x86_64.1
Processing 37/352: [async_websocket.v0.17.0: http] [core.v0.17.1: extract] [core_kernel.v0.17.0: extract] [conf-mingw-w64-gcc-i686: i686-w64-mingw32-gcc] [conf-pkg-config: pkgconf]
+ C:\cygwin64\bin\i686-w64-mingw32-gcc.exe "--version" (CWD=C:\Users\opam\AppData\Local\opam\5.3\.opam-switch\build\conf-mingw-w64-gcc-i686.1)
- i686-w64-mingw32-gcc (GCC) 12.4.0
- Copyright (C) 2022 Free Software Foundation, Inc.
- This is free software; see the source for copying conditions.  There is NO
- warranty; not even for MERCHANTABILITY or FITNESS FOR A PARTICULAR PURPOSE.
- 
-> compiled  conf-mingw-w64-gcc-i686.1
Processing 37/352: [async_websocket.v0.17.0: http] [core.v0.17.1: extract] [core_kernel.v0.17.0: extract] [conf-pkg-config: pkgconf]
-> installed conf-mingw-w64-gcc-i686.1
Processing 38/352: [async_websocket.v0.17.0: http] [core.v0.17.1: extract] [core_kernel.v0.17.0: extract] [conf-pkg-config: pkgconf]
Processing 39/352: [async_websocket.v0.17.0: http] [core.v0.17.1: extract] [core_kernel.v0.17.0: extract] [conf-mingw-w64-g++-i686: i686-w64-mingw32-g++] [conf-pkg-config: pkgconf]
-> retrieved core.v0.17.1  (cached)
Processing 39/352: [async_websocket.v0.17.0: http] [core_kernel.v0.17.0: extract] [conf-mingw-w64-g++-i686: i686-w64-mingw32-g++] [conf-pkg-config: pkgconf]
Processing 40/352: [async_websocket.v0.17.0: http] [core_kernel.v0.17.0: extract] [core_unix.v0.17.0: extract] [conf-mingw-w64-g++-i686: i686-w64-mingw32-g++] [conf-pkg-config: pkgconf]
-> retrieved core_kernel.v0.17.0  (cached)
Processing 40/352: [async_websocket.v0.17.0: http] [core_unix.v0.17.0: extract] [conf-mingw-w64-g++-i686: i686-w64-mingw32-g++] [conf-pkg-config: pkgconf]
Processing 41/352: [async_websocket.v0.17.0: http] [core_unix.v0.17.0: extract] [cryptokit.1.16.1: http] [conf-mingw-w64-g++-i686: i686-w64-mingw32-g++] [conf-pkg-config: pkgconf]
-> retrieved core_unix.v0.17.0  (cached)
Processing 41/352: [async_websocket.v0.17.0: http] [cryptokit.1.16.1: http] [conf-mingw-w64-g++-i686: i686-w64-mingw32-g++] [conf-pkg-config: pkgconf]
Processing 42/352: [async_websocket.v0.17.0: http] [cryptokit.1.16.1: http] [csexp.1.5.2: extract] [conf-mingw-w64-g++-i686: i686-w64-mingw32-g++] [conf-pkg-config: pkgconf]
+ C:\cygwin64\bin\i686-w64-mingw32-g++.exe "--version" (CWD=C:\Users\opam\AppData\Local\opam\5.3\.opam-switch\build\conf-mingw-w64-g++-i686.1)
- i686-w64-mingw32-g++ (GCC) 12.4.0
- Copyright (C) 2022 Free Software Foundation, Inc.
- This is free software; see the source for copying conditions.  There is NO
- warranty; not even for MERCHANTABILITY or FITNESS FOR A PARTICULAR PURPOSE.
- 
-> compiled  conf-mingw-w64-g++-i686.1
Processing 42/352: [async_websocket.v0.17.0: http] [cryptokit.1.16.1: http] [csexp.1.5.2: extract] [conf-pkg-config: pkgconf]
-> installed conf-mingw-w64-g++-i686.1
Processing 43/352: [async_websocket.v0.17.0: http] [cryptokit.1.16.1: http] [csexp.1.5.2: extract] [conf-pkg-config: pkgconf]
Processing 44/352: [async_websocket.v0.17.0: http] [cryptokit.1.16.1: http] [csexp.1.5.2: extract] [conf-g++: x86_64-w64-mingw32-g++] [conf-pkg-config: pkgconf]
-> retrieved csexp.1.5.2  (cached)
Processing 44/352: [async_websocket.v0.17.0: http] [cryptokit.1.16.1: http] [conf-g++: x86_64-w64-mingw32-g++] [conf-pkg-config: pkgconf]
Processing 45/352: [async_websocket.v0.17.0: http] [cryptokit.1.16.1: http] [cstruct.6.2.0: extract] [conf-g++: x86_64-w64-mingw32-g++] [conf-pkg-config: pkgconf]
+ C:\cygwin64\bin\x86_64-w64-mingw32-g++.exe "--version" (CWD=C:\Users\opam\AppData\Local\opam\5.3\.opam-switch\build\conf-g++.1.0)
- x86_64-w64-mingw32-g++ (GCC) 12.4.0
- Copyright (C) 2022 Free Software Foundation, Inc.
- This is free software; see the source for copying conditions.  There is NO
- warranty; not even for MERCHANTABILITY or FITNESS FOR A PARTICULAR PURPOSE.
- 
-> compiled  conf-g++.1.0
Processing 45/352: [async_websocket.v0.17.0: http] [cryptokit.1.16.1: http] [cstruct.6.2.0: extract] [conf-pkg-config: pkgconf]
-> installed conf-g++.1.0
Processing 46/352: [async_websocket.v0.17.0: http] [cryptokit.1.16.1: http] [cstruct.6.2.0: extract] [conf-pkg-config: pkgconf]
+ C:\cygwin64\bin\pkgconf.exe "--version" (CWD=C:\Users\opam\AppData\Local\opam\5.3\.opam-switch\build\conf-pkg-config.3)
- 2.3.0
-> compiled  conf-pkg-config.3
Processing 46/352: [async_websocket.v0.17.0: http] [cryptokit.1.16.1: http] [cstruct.6.2.0: extract]
-> installed conf-pkg-config.3
Processing 47/352: [async_websocket.v0.17.0: http] [cryptokit.1.16.1: http] [cstruct.6.2.0: extract]
Processing 48/352: [async_websocket.v0.17.0: http] [cryptokit.1.16.1: http] [cstruct.6.2.0: extract] [conf-mingw-w64-gmp-i686: pkgconf gmp]
Processing 49/352: [async_websocket.v0.17.0: http] [cryptokit.1.16.1: http] [cstruct.6.2.0: extract] [conf-mingw-w64-gmp-i686: pkgconf gmp] [conf-mingw-w64-gmp-x86_64: pkgconf gmp]
Processing 50/352: [async_websocket.v0.17.0: http] [cryptokit.1.16.1: http] [cstruct.6.2.0: extract] [conf-mingw-w64-gmp-i686: pkgconf gmp] [conf-mingw-w64-gmp-x86_64: pkgconf gmp] [conf-mingw-w64-libffi-i686: pkgconf libffi]
Processing 51/352: [async_websocket.v0.17.0: http] [cryptokit.1.16.1: http] [cstruct.6.2.0: extract] [conf-mingw-w64-gmp-i686: pkgconf gmp] [conf-mingw-w64-gmp-x86_64: pkgconf gmp] [conf-mingw-w64-libffi-i686: pkgconf libffi] [conf-mingw-w64-libffi-x86_64: pkgconf libffi]
Processing 52/352: [async_websocket.v0.17.0: http] [cryptokit.1.16.1: http] [cstruct.6.2.0: extract] [conf-mingw-w64-gmp-i686: pkgconf gmp] [conf-mingw-w64-gmp-x86_64: pkgconf gmp] [conf-mingw-w64-libffi-i686: pkgconf libffi] [conf-mingw-w64-libffi-x86_64: pkgconf libffi] [conf-mingw-w64-openssl-i686: pkgconf openssl]
Processing 53/352: [async_websocket.v0.17.0: http] [cryptokit.1.16.1: http] [cstruct.6.2.0: extract] [conf-mingw-w64-gmp-i686: pkgconf gmp] [conf-mingw-w64-gmp-x86_64: pkgconf gmp] [conf-mingw-w64-libffi-i686: pkgconf libffi] [conf-mingw-w64-libffi-x86_64: pkgconf libffi] [conf-mingw-w64-openssl-i686: pkgconf openssl] [conf-mingw-w64-openssl-x86_64: pkgconf openssl]
Processing 54/352: [async_websocket.v0.17.0: http] [cryptokit.1.16.1: http] [cstruct.6.2.0: extract] [conf-mingw-w64-gmp-i686: pkgconf gmp] [conf-mingw-w64-gmp-x86_64: pkgconf gmp] [conf-mingw-w64-libffi-i686: pkgconf libffi] [conf-mingw-w64-libffi-x86_64: pkgconf libffi] [conf-mingw-w64-openssl-i686: pkgconf openssl] [conf-mingw-w64-openssl-x86_64: pkgconf openssl] [conf-mingw-w64-zlib-i686: pkgconf zlib]
Processing 55/352: [async_websocket.v0.17.0: http] [cryptokit.1.16.1: http] [cstruct.6.2.0: extract] [conf-mingw-w64-gmp-i686: pkgconf gmp] [conf-mingw-w64-gmp-x86_64: pkgconf gmp] [conf-mingw-w64-libffi-i686: pkgconf libffi] [conf-mingw-w64-libffi-x86_64: pkgconf libffi] [conf-mingw-w64-openssl-i686: pkgconf openssl] [conf-mingw-w64-openssl-x86_64: pkgconf openssl] [conf-mingw-w64-zlib-i686: pkgconf zlib] [conf-mingw-w64-zlib-x86_64: pkgconf zlib]
-> retrieved cstruct.6.2.0  (cached)
Processing 55/352: [async_websocket.v0.17.0: http] [cryptokit.1.16.1: http] [conf-mingw-w64-gmp-i686: pkgconf gmp] [conf-mingw-w64-gmp-x86_64: pkgconf gmp] [conf-mingw-w64-libffi-i686: pkgconf libffi] [conf-mingw-w64-libffi-x86_64: pkgconf libffi] [conf-mingw-w64-openssl-i686: pkgconf openssl] [conf-mingw-w64-openssl-x86_64: pkgconf openssl] [conf-mingw-w64-zlib-i686: pkgconf zlib] [conf-mingw-w64-zlib-x86_64: pkgconf zlib]
Processing 56/352: [async_websocket.v0.17.0: http] [cryptokit.1.16.1: http] [ctypes.0.23.0, ctypes-foreign.0.23.0: extract] [conf-mingw-w64-gmp-i686: pkgconf gmp] [conf-mingw-w64-gmp-x86_64: pkgconf gmp] [conf-mingw-w64-libffi-i686: pkgconf libffi] [conf-mingw-w64-libffi-x86_64: pkgconf libffi] [conf-mingw-w64-openssl-i686: pkgconf openssl] [conf-mingw-w64-openssl-x86_64: pkgconf openssl] [conf-mingw-w64-zlib-i686: pkgconf zlib] [conf-mingw-w64-zlib-x86_64: pkgconf zlib]
+ C:\cygwin64\bin\pkgconf.exe "--personality=i686-w64-mingw32" "gmp" (CWD=C:\Users\opam\AppData\Local\opam\5.3\.opam-switch\build\conf-mingw-w64-gmp-i686.1)
-> compiled  conf-mingw-w64-gmp-i686.1
Processing 56/352: [async_websocket.v0.17.0: http] [cryptokit.1.16.1: http] [ctypes.0.23.0, ctypes-foreign.0.23.0: extract] [conf-mingw-w64-gmp-x86_64: pkgconf gmp] [conf-mingw-w64-libffi-i686: pkgconf libffi] [conf-mingw-w64-libffi-x86_64: pkgconf libffi] [conf-mingw-w64-openssl-i686: pkgconf openssl] [conf-mingw-w64-openssl-x86_64: pkgconf openssl] [conf-mingw-w64-zlib-i686: pkgconf zlib] [conf-mingw-w64-zlib-x86_64: pkgconf zlib]
-> installed conf-mingw-w64-gmp-i686.1
Processing 57/352: [async_websocket.v0.17.0: http] [cryptokit.1.16.1: http] [ctypes.0.23.0, ctypes-foreign.0.23.0: extract] [conf-mingw-w64-gmp-x86_64: pkgconf gmp] [conf-mingw-w64-libffi-i686: pkgconf libffi] [conf-mingw-w64-libffi-x86_64: pkgconf libffi] [conf-mingw-w64-openssl-i686: pkgconf openssl] [conf-mingw-w64-openssl-x86_64: pkgconf openssl] [conf-mingw-w64-zlib-i686: pkgconf zlib] [conf-mingw-w64-zlib-x86_64: pkgconf zlib]
Processing 57/352: [async_websocket.v0.17.0: http] [cryptokit.1.16.1: extract] [ctypes.0.23.0, ctypes-foreign.0.23.0: extract] [conf-mingw-w64-gmp-x86_64: pkgconf gmp] [conf-mingw-w64-libffi-i686: pkgconf libffi] [conf-mingw-w64-libffi-x86_64: pkgconf libffi] [conf-mingw-w64-openssl-i686: pkgconf openssl] [conf-mingw-w64-openssl-x86_64: pkgconf openssl] [conf-mingw-w64-zlib-i686: pkgconf zlib] [conf-mingw-w64-zlib-x86_64: pkgconf zlib]
+ C:\cygwin64\bin\pkgconf.exe "--personality=x86_64-w64-mingw32" "gmp" (CWD=C:\Users\opam\AppData\Local\opam\5.3\.opam-switch\build\conf-mingw-w64-gmp-x86_64.1)
-> compiled  conf-mingw-w64-gmp-x86_64.1
Processing 57/352: [async_websocket.v0.17.0: http] [cryptokit.1.16.1: extract] [ctypes.0.23.0, ctypes-foreign.0.23.0: extract] [conf-mingw-w64-libffi-i686: pkgconf libffi] [conf-mingw-w64-libffi-x86_64: pkgconf libffi] [conf-mingw-w64-openssl-i686: pkgconf openssl] [conf-mingw-w64-openssl-x86_64: pkgconf openssl] [conf-mingw-w64-zlib-i686: pkgconf zlib] [conf-mingw-w64-zlib-x86_64: pkgconf zlib]
-> installed conf-mingw-w64-gmp-x86_64.1
Processing 58/352: [async_websocket.v0.17.0: http] [cryptokit.1.16.1: extract] [ctypes.0.23.0, ctypes-foreign.0.23.0: extract] [conf-mingw-w64-libffi-i686: pkgconf libffi] [conf-mingw-w64-libffi-x86_64: pkgconf libffi] [conf-mingw-w64-openssl-i686: pkgconf openssl] [conf-mingw-w64-openssl-x86_64: pkgconf openssl] [conf-mingw-w64-zlib-i686: pkgconf zlib] [conf-mingw-w64-zlib-x86_64: pkgconf zlib]
Processing 59/352: [async_websocket.v0.17.0: http] [cryptokit.1.16.1: extract] [ctypes.0.23.0, ctypes-foreign.0.23.0: extract] [conf-gmp: sh x86_64-w64-mingw32-gcc -c $CFLAGS test.c] [conf-mingw-w64-libffi-i686: pkgconf libffi] [conf-mingw-w64-libffi-x86_64: pkgconf libffi] [conf-mingw-w64-openssl-i686: pkgconf openssl] [conf-mingw-w64-openssl-x86_64: pkgconf openssl] [conf-mingw-w64-zlib-i686: pkgconf zlib] [conf-mingw-w64-zlib-x86_64: pkgconf zlib]
-> retrieved cryptokit.1.16.1  (https://github.com/xavierleroy/cryptokit/archive/release1161.tar.gz)
Processing 59/352: [async_websocket.v0.17.0: http] [ctypes.0.23.0, ctypes-foreign.0.23.0: extract] [conf-gmp: sh x86_64-w64-mingw32-gcc -c $CFLAGS test.c] [conf-mingw-w64-libffi-i686: pkgconf libffi] [conf-mingw-w64-libffi-x86_64: pkgconf libffi] [conf-mingw-w64-openssl-i686: pkgconf openssl] [conf-mingw-w64-openssl-x86_64: pkgconf openssl] [conf-mingw-w64-zlib-i686: pkgconf zlib] [conf-mingw-w64-zlib-x86_64: pkgconf zlib]
Processing 60/352: [async_websocket.v0.17.0: http] [ctypes.0.23.0, ctypes-foreign.0.23.0: extract] [dune.3.17.1, dune-configurator.3.17.1: extract] [conf-gmp: sh x86_64-w64-mingw32-gcc -c $CFLAGS test.c] [conf-mingw-w64-libffi-i686: pkgconf libffi] [conf-mingw-w64-libffi-x86_64: pkgconf libffi] [conf-mingw-w64-openssl-i686: pkgconf openssl] [conf-mingw-w64-openssl-x86_64: pkgconf openssl] [conf-mingw-w64-zlib-i686: pkgconf zlib] [conf-mingw-w64-zlib-x86_64: pkgconf zlib]
-> retrieved ctypes.0.23.0, ctypes-foreign.0.23.0  (cached)
Processing 60/352: [async_websocket.v0.17.0: http] [dune.3.17.1, dune-configurator.3.17.1: extract] [conf-gmp: sh x86_64-w64-mingw32-gcc -c $CFLAGS test.c] [conf-mingw-w64-libffi-i686: pkgconf libffi] [conf-mingw-w64-libffi-x86_64: pkgconf libffi] [conf-mingw-w64-openssl-i686: pkgconf openssl] [conf-mingw-w64-openssl-x86_64: pkgconf openssl] [conf-mingw-w64-zlib-i686: pkgconf zlib] [conf-mingw-w64-zlib-x86_64: pkgconf zlib]
Processing 61/352: [async_websocket.v0.17.0: http] [dune.3.17.1, dune-configurator.3.17.1: extract] [expect_test_helpers_core.v0.17.0: extract] [conf-gmp: sh x86_64-w64-mingw32-gcc -c $CFLAGS test.c] [conf-mingw-w64-libffi-i686: pkgconf libffi] [conf-mingw-w64-libffi-x86_64: pkgconf libffi] [conf-mingw-w64-openssl-i686: pkgconf openssl] [conf-mingw-w64-openssl-x86_64: pkgconf openssl] [conf-mingw-w64-zlib-i686: pkgconf zlib] [conf-mingw-w64-zlib-x86_64: pkgconf zlib]
+ C:\cygwin64\bin\sh.exe "-exc" "x86_64-w64-mingw32-gcc -c $CFLAGS test.c" (CWD=C:\Users\opam\AppData\Local\opam\5.3\.opam-switch\build\conf-gmp.4)
- + x86_64-w64-mingw32-gcc -c test.c
-> compiled  conf-gmp.4
Processing 61/352: [async_websocket.v0.17.0: http] [dune.3.17.1, dune-configurator.3.17.1: extract] [expect_test_helpers_core.v0.17.0: extract] [conf-mingw-w64-libffi-i686: pkgconf libffi] [conf-mingw-w64-libffi-x86_64: pkgconf libffi] [conf-mingw-w64-openssl-i686: pkgconf openssl] [conf-mingw-w64-openssl-x86_64: pkgconf openssl] [conf-mingw-w64-zlib-i686: pkgconf zlib] [conf-mingw-w64-zlib-x86_64: pkgconf zlib]
-> installed conf-gmp.4
Processing 62/352: [async_websocket.v0.17.0: http] [dune.3.17.1, dune-configurator.3.17.1: extract] [expect_test_helpers_core.v0.17.0: extract] [conf-mingw-w64-libffi-i686: pkgconf libffi] [conf-mingw-w64-libffi-x86_64: pkgconf libffi] [conf-mingw-w64-openssl-i686: pkgconf openssl] [conf-mingw-w64-openssl-x86_64: pkgconf openssl] [conf-mingw-w64-zlib-i686: pkgconf zlib] [conf-mingw-w64-zlib-x86_64: pkgconf zlib]
Processing 63/352: [async_websocket.v0.17.0: http] [dune.3.17.1, dune-configurator.3.17.1: extract] [expect_test_helpers_core.v0.17.0: extract] [conf-gmp-powm-sec: sh x86_64-w64-mingw32-gcc -c $CFLAGS test.c] [conf-mingw-w64-libffi-i686: pkgconf libffi] [conf-mingw-w64-libffi-x86_64: pkgconf libffi] [conf-mingw-w64-openssl-i686: pkgconf openssl] [conf-mingw-w64-openssl-x86_64: pkgconf openssl] [conf-mingw-w64-zlib-i686: pkgconf zlib] [conf-mingw-w64-zlib-x86_64: pkgconf zlib]
+ C:\cygwin64\bin\pkgconf.exe "--personality=i686-w64-mingw32" "libffi" (CWD=C:\Users\opam\AppData\Local\opam\5.3\.opam-switch\build\conf-mingw-w64-libffi-i686.1)
-> compiled  conf-mingw-w64-libffi-i686.1
Processing 63/352: [async_websocket.v0.17.0: http] [dune.3.17.1, dune-configurator.3.17.1: extract] [expect_test_helpers_core.v0.17.0: extract] [conf-gmp-powm-sec: sh x86_64-w64-mingw32-gcc -c $CFLAGS test.c] [conf-mingw-w64-libffi-x86_64: pkgconf libffi] [conf-mingw-w64-openssl-i686: pkgconf openssl] [conf-mingw-w64-openssl-x86_64: pkgconf openssl] [conf-mingw-w64-zlib-i686: pkgconf zlib] [conf-mingw-w64-zlib-x86_64: pkgconf zlib]
-> installed conf-mingw-w64-libffi-i686.1
Processing 64/352: [async_websocket.v0.17.0: http] [dune.3.17.1, dune-configurator.3.17.1: extract] [expect_test_helpers_core.v0.17.0: extract] [conf-gmp-powm-sec: sh x86_64-w64-mingw32-gcc -c $CFLAGS test.c] [conf-mingw-w64-libffi-x86_64: pkgconf libffi] [conf-mingw-w64-openssl-i686: pkgconf openssl] [conf-mingw-w64-openssl-x86_64: pkgconf openssl] [conf-mingw-w64-zlib-i686: pkgconf zlib] [conf-mingw-w64-zlib-x86_64: pkgconf zlib]
-> retrieved expect_test_helpers_core.v0.17.0  (cached)
Processing 64/352: [async_websocket.v0.17.0: http] [dune.3.17.1, dune-configurator.3.17.1: extract] [conf-gmp-powm-sec: sh x86_64-w64-mingw32-gcc -c $CFLAGS test.c] [conf-mingw-w64-libffi-x86_64: pkgconf libffi] [conf-mingw-w64-openssl-i686: pkgconf openssl] [conf-mingw-w64-openssl-x86_64: pkgconf openssl] [conf-mingw-w64-zlib-i686: pkgconf zlib] [conf-mingw-w64-zlib-x86_64: pkgconf zlib]
Processing 65/352: [async_websocket.v0.17.0: http] [dune.3.17.1, dune-configurator.3.17.1: extract] [fieldslib.v0.17.0: extract] [conf-gmp-powm-sec: sh x86_64-w64-mingw32-gcc -c $CFLAGS test.c] [conf-mingw-w64-libffi-x86_64: pkgconf libffi] [conf-mingw-w64-openssl-i686: pkgconf openssl] [conf-mingw-w64-openssl-x86_64: pkgconf openssl] [conf-mingw-w64-zlib-i686: pkgconf zlib] [conf-mingw-w64-zlib-x86_64: pkgconf zlib]
+ C:\cygwin64\bin\pkgconf.exe "--personality=x86_64-w64-mingw32" "libffi" (CWD=C:\Users\opam\AppData\Local\opam\5.3\.opam-switch\build\conf-mingw-w64-libffi-x86_64.1)
-> compiled  conf-mingw-w64-libffi-x86_64.1
Processing 65/352: [async_websocket.v0.17.0: http] [dune.3.17.1, dune-configurator.3.17.1: extract] [fieldslib.v0.17.0: extract] [conf-gmp-powm-sec: sh x86_64-w64-mingw32-gcc -c $CFLAGS test.c] [conf-mingw-w64-openssl-i686: pkgconf openssl] [conf-mingw-w64-openssl-x86_64: pkgconf openssl] [conf-mingw-w64-zlib-i686: pkgconf zlib] [conf-mingw-w64-zlib-x86_64: pkgconf zlib]
-> installed conf-mingw-w64-libffi-x86_64.1
Processing 66/352: [async_websocket.v0.17.0: http] [dune.3.17.1, dune-configurator.3.17.1: extract] [fieldslib.v0.17.0: extract] [conf-gmp-powm-sec: sh x86_64-w64-mingw32-gcc -c $CFLAGS test.c] [conf-mingw-w64-openssl-i686: pkgconf openssl] [conf-mingw-w64-openssl-x86_64: pkgconf openssl] [conf-mingw-w64-zlib-i686: pkgconf zlib] [conf-mingw-w64-zlib-x86_64: pkgconf zlib]
Processing 67/352: [async_websocket.v0.17.0: http] [dune.3.17.1, dune-configurator.3.17.1: extract] [fieldslib.v0.17.0: extract] [conf-gmp-powm-sec: sh x86_64-w64-mingw32-gcc -c $CFLAGS test.c] [conf-libffi: pkgconf libffi] [conf-mingw-w64-openssl-i686: pkgconf openssl] [conf-mingw-w64-openssl-x86_64: pkgconf openssl] [conf-mingw-w64-zlib-i686: pkgconf zlib] [conf-mingw-w64-zlib-x86_64: pkgconf zlib]
-> retrieved fieldslib.v0.17.0  (cached)
Processing 67/352: [async_websocket.v0.17.0: http] [dune.3.17.1, dune-configurator.3.17.1: extract] [conf-gmp-powm-sec: sh x86_64-w64-mingw32-gcc -c $CFLAGS test.c] [conf-libffi: pkgconf libffi] [conf-mingw-w64-openssl-i686: pkgconf openssl] [conf-mingw-w64-openssl-x86_64: pkgconf openssl] [conf-mingw-w64-zlib-i686: pkgconf zlib] [conf-mingw-w64-zlib-x86_64: pkgconf zlib]
Processing 68/352: [async_websocket.v0.17.0: http] [dune.3.17.1, dune-configurator.3.17.1: extract] [fmt.0.9.0: extract] [conf-gmp-powm-sec: sh x86_64-w64-mingw32-gcc -c $CFLAGS test.c] [conf-libffi: pkgconf libffi] [conf-mingw-w64-openssl-i686: pkgconf openssl] [conf-mingw-w64-openssl-x86_64: pkgconf openssl] [conf-mingw-w64-zlib-i686: pkgconf zlib] [conf-mingw-w64-zlib-x86_64: pkgconf zlib]
+ C:\cygwin64\bin\sh.exe "-exc" "x86_64-w64-mingw32-gcc -c $CFLAGS test.c" (CWD=C:\Users\opam\AppData\Local\opam\5.3\.opam-switch\build\conf-gmp-powm-sec.3)
- + x86_64-w64-mingw32-gcc -c test.c
-> compiled  conf-gmp-powm-sec.3
Processing 68/352: [async_websocket.v0.17.0: http] [dune.3.17.1, dune-configurator.3.17.1: extract] [fmt.0.9.0: extract] [conf-libffi: pkgconf libffi] [conf-mingw-w64-openssl-i686: pkgconf openssl] [conf-mingw-w64-openssl-x86_64: pkgconf openssl] [conf-mingw-w64-zlib-i686: pkgconf zlib] [conf-mingw-w64-zlib-x86_64: pkgconf zlib]
-> installed conf-gmp-powm-sec.3
Processing 69/352: [async_websocket.v0.17.0: http] [dune.3.17.1, dune-configurator.3.17.1: extract] [fmt.0.9.0: extract] [conf-libffi: pkgconf libffi] [conf-mingw-w64-openssl-i686: pkgconf openssl] [conf-mingw-w64-openssl-x86_64: pkgconf openssl] [conf-mingw-w64-zlib-i686: pkgconf zlib] [conf-mingw-w64-zlib-x86_64: pkgconf zlib]
+ C:\cygwin64\bin\pkgconf.exe "--personality=x86_64-w64-mingw32" "libffi" (CWD=C:\Users\opam\AppData\Local\opam\5.3\.opam-switch\build\conf-libffi.2.0.0)
-> compiled  conf-libffi.2.0.0
Processing 69/352: [async_websocket.v0.17.0: http] [dune.3.17.1, dune-configurator.3.17.1: extract] [fmt.0.9.0: extract] [conf-mingw-w64-openssl-i686: pkgconf openssl] [conf-mingw-w64-openssl-x86_64: pkgconf openssl] [conf-mingw-w64-zlib-i686: pkgconf zlib] [conf-mingw-w64-zlib-x86_64: pkgconf zlib]
-> installed conf-libffi.2.0.0
Processing 70/352: [async_websocket.v0.17.0: http] [dune.3.17.1, dune-configurator.3.17.1: extract] [fmt.0.9.0: extract] [conf-mingw-w64-openssl-i686: pkgconf openssl] [conf-mingw-w64-openssl-x86_64: pkgconf openssl] [conf-mingw-w64-zlib-i686: pkgconf zlib] [conf-mingw-w64-zlib-x86_64: pkgconf zlib]
+ C:\cygwin64\bin\pkgconf.exe "--personality=i686-w64-mingw32" "openssl" (CWD=C:\Users\opam\AppData\Local\opam\5.3\.opam-switch\build\conf-mingw-w64-openssl-i686.1)
-> compiled  conf-mingw-w64-openssl-i686.1
Processing 70/352: [async_websocket.v0.17.0: http] [dune.3.17.1, dune-configurator.3.17.1: extract] [fmt.0.9.0: extract] [conf-mingw-w64-openssl-x86_64: pkgconf openssl] [conf-mingw-w64-zlib-i686: pkgconf zlib] [conf-mingw-w64-zlib-x86_64: pkgconf zlib]
-> installed conf-mingw-w64-openssl-i686.1
Processing 71/352: [async_websocket.v0.17.0: http] [dune.3.17.1, dune-configurator.3.17.1: extract] [fmt.0.9.0: extract] [conf-mingw-w64-openssl-x86_64: pkgconf openssl] [conf-mingw-w64-zlib-i686: pkgconf zlib] [conf-mingw-w64-zlib-x86_64: pkgconf zlib]
+ C:\cygwin64\bin\pkgconf.exe "--personality=x86_64-w64-mingw32" "openssl" (CWD=C:\Users\opam\AppData\Local\opam\5.3\.opam-switch\build\conf-mingw-w64-openssl-x86_64.1)
-> compiled  conf-mingw-w64-openssl-x86_64.1
Processing 71/352: [async_websocket.v0.17.0: http] [dune.3.17.1, dune-configurator.3.17.1: extract] [fmt.0.9.0: extract] [conf-mingw-w64-zlib-i686: pkgconf zlib] [conf-mingw-w64-zlib-x86_64: pkgconf zlib]
-> installed conf-mingw-w64-openssl-x86_64.1
Processing 72/352: [async_websocket.v0.17.0: http] [dune.3.17.1, dune-configurator.3.17.1: extract] [fmt.0.9.0: extract] [conf-mingw-w64-zlib-i686: pkgconf zlib] [conf-mingw-w64-zlib-x86_64: pkgconf zlib]
Processing 73/352: [async_websocket.v0.17.0: http] [dune.3.17.1, dune-configurator.3.17.1: extract] [fmt.0.9.0: extract] [conf-libssl: pkgconf openssl] [conf-mingw-w64-zlib-i686: pkgconf zlib] [conf-mingw-w64-zlib-x86_64: pkgconf zlib]
-> retrieved fmt.0.9.0  (cached)
Processing 73/352: [async_websocket.v0.17.0: http] [dune.3.17.1, dune-configurator.3.17.1: extract] [conf-libssl: pkgconf openssl] [conf-mingw-w64-zlib-i686: pkgconf zlib] [conf-mingw-w64-zlib-x86_64: pkgconf zlib]
Processing 74/352: [async_websocket.v0.17.0: http] [dune.3.17.1, dune-configurator.3.17.1: extract] [gel.v0.17.0: extract] [conf-libssl: pkgconf openssl] [conf-mingw-w64-zlib-i686: pkgconf zlib] [conf-mingw-w64-zlib-x86_64: pkgconf zlib]
+ C:\cygwin64\bin\pkgconf.exe "--personality=x86_64-w64-mingw32" "--print-errors" "--exists" "openssl" (CWD=C:\Users\opam\AppData\Local\opam\5.3\.opam-switch\build\conf-libssl.4)
-> compiled  conf-libssl.4
Processing 74/352: [async_websocket.v0.17.0: http] [dune.3.17.1, dune-configurator.3.17.1: extract] [gel.v0.17.0: extract] [conf-mingw-w64-zlib-i686: pkgconf zlib] [conf-mingw-w64-zlib-x86_64: pkgconf zlib]
-> installed conf-libssl.4
Processing 75/352: [async_websocket.v0.17.0: http] [dune.3.17.1, dune-configurator.3.17.1: extract] [gel.v0.17.0: extract] [conf-mingw-w64-zlib-i686: pkgconf zlib] [conf-mingw-w64-zlib-x86_64: pkgconf zlib]
+ C:\cygwin64\bin\pkgconf.exe "--personality=i686-w64-mingw32" "zlib" (CWD=C:\Users\opam\AppData\Local\opam\5.3\.opam-switch\build\conf-mingw-w64-zlib-i686.1)
-> compiled  conf-mingw-w64-zlib-i686.1
Processing 75/352: [async_websocket.v0.17.0: http] [dune.3.17.1, dune-configurator.3.17.1: extract] [gel.v0.17.0: extract] [conf-mingw-w64-zlib-x86_64: pkgconf zlib]
-> installed conf-mingw-w64-zlib-i686.1
Processing 76/352: [async_websocket.v0.17.0: http] [dune.3.17.1, dune-configurator.3.17.1: extract] [gel.v0.17.0: extract] [conf-mingw-w64-zlib-x86_64: pkgconf zlib]
-> retrieved gel.v0.17.0  (cached)
Processing 76/352: [async_websocket.v0.17.0: http] [dune.3.17.1, dune-configurator.3.17.1: extract] [conf-mingw-w64-zlib-x86_64: pkgconf zlib]
Processing 77/352: [async_websocket.v0.17.0: http] [dune.3.17.1, dune-configurator.3.17.1: extract] [int_repr.v0.17.0: extract] [conf-mingw-w64-zlib-x86_64: pkgconf zlib]
+ C:\cygwin64\bin\pkgconf.exe "--personality=x86_64-w64-mingw32" "zlib" (CWD=C:\Users\opam\AppData\Local\opam\5.3\.opam-switch\build\conf-mingw-w64-zlib-x86_64.1)
-> compiled  conf-mingw-w64-zlib-x86_64.1
Processing 77/352: [async_websocket.v0.17.0: http] [dune.3.17.1, dune-configurator.3.17.1: extract] [int_repr.v0.17.0: extract]
-> installed conf-mingw-w64-zlib-x86_64.1
Processing 78/352: [async_websocket.v0.17.0: http] [dune.3.17.1, dune-configurator.3.17.1: extract] [int_repr.v0.17.0: extract]
Processing 79/352: [async_websocket.v0.17.0: http] [dune.3.17.1, dune-configurator.3.17.1: extract] [int_repr.v0.17.0: extract] [conf-zlib: pkgconf zlib]
-> retrieved int_repr.v0.17.0  (cached)
Processing 79/352: [async_websocket.v0.17.0: http] [dune.3.17.1, dune-configurator.3.17.1: extract] [conf-zlib: pkgconf zlib]
Processing 80/352: [async_websocket.v0.17.0: http] [dune.3.17.1, dune-configurator.3.17.1: extract] [integers.0.7.0: extract] [conf-zlib: pkgconf zlib]
+ C:\cygwin64\bin\pkgconf.exe "--personality=x86_64-w64-mingw32" "zlib" (CWD=C:\Users\opam\AppData\Local\opam\5.3\.opam-switch\build\conf-zlib.1)
-> compiled  conf-zlib.1
Processing 80/352: [async_websocket.v0.17.0: http] [dune.3.17.1, dune-configurator.3.17.1: extract] [integers.0.7.0: extract]
-> installed conf-zlib.1
Processing 81/352: [async_websocket.v0.17.0: http] [dune.3.17.1, dune-configurator.3.17.1: extract] [integers.0.7.0: extract]
-> retrieved integers.0.7.0  (cached)
Processing 81/352: [async_websocket.v0.17.0: http] [dune.3.17.1, dune-configurator.3.17.1: extract]
Processing 82/352: [async_websocket.v0.17.0: http] [dune.3.17.1, dune-configurator.3.17.1: extract] [jane-street-headers.v0.17.0: extract]
-> retrieved jane-street-headers.v0.17.0  (cached)
Processing 82/352: [async_websocket.v0.17.0: http] [dune.3.17.1, dune-configurator.3.17.1: extract]
Processing 83/352: [async_websocket.v0.17.0: http] [dune.3.17.1, dune-configurator.3.17.1: extract] [jane_rope.v0.17.0: http]
Processing 83/352: [async_websocket.v0.17.0: http] [dune.3.17.1, dune-configurator.3.17.1: extract] [jane_rope.v0.17.0: extract]
-> retrieved jane_rope.v0.17.0  (https://github.com/janestreet/jane_rope/archive/refs/tags/v0.17.0.tar.gz)
Processing 83/352: [async_websocket.v0.17.0: http] [dune.3.17.1, dune-configurator.3.17.1: extract]
Processing 84/352: [async_websocket.v0.17.0: http] [dune.3.17.1, dune-configurator.3.17.1: extract] [jst-config.v0.17.0: extract]
-> retrieved jst-config.v0.17.0  (cached)
Processing 84/352: [async_websocket.v0.17.0: http] [dune.3.17.1, dune-configurator.3.17.1: extract]
Processing 85/352: [async_websocket.v0.17.0: http] [dune.3.17.1, dune-configurator.3.17.1: extract] [mingw-w64-shims.0.2.0: extract]
-> retrieved mingw-w64-shims.0.2.0  (cached)
Processing 85/352: [async_websocket.v0.17.0: http] [dune.3.17.1, dune-configurator.3.17.1: extract]
-> removed   mingw-w64-shims.0.2.0
Processing 86/352: [async_websocket.v0.17.0: http] [dune.3.17.1, dune-configurator.3.17.1: extract]
Processing 87/352: [async_websocket.v0.17.0: http] [dune.3.17.1, dune-configurator.3.17.1: extract] [num.1.5-1: extract]
Processing 88/352: [async_websocket.v0.17.0: http] [dune.3.17.1, dune-configurator.3.17.1: extract] [num.1.5-1: extract] [mingw-w64-shims: sh mingw-w64-shims]
-> retrieved num.1.5-1  (cached)
Processing 88/352: [async_websocket.v0.17.0: http] [dune.3.17.1, dune-configurator.3.17.1: extract] [mingw-w64-shims: sh mingw-w64-shims]
Processing 89/352: [async_websocket.v0.17.0: http] [dune.3.17.1, dune-configurator.3.17.1: extract] [ocaml-compiler-libs.v0.17.0: extract] [mingw-w64-shims: sh mingw-w64-shims]
[num: patch] applying num-in-findlib-dir.patch
Processing 90/352: [async_websocket.v0.17.0: http] [dune.3.17.1, dune-configurator.3.17.1: extract] [ocaml-compiler-libs.v0.17.0: extract] [mingw-w64-shims: sh mingw-w64-shims] [num: patch]
-> retrieved ocaml-compiler-libs.v0.17.0  (cached)
Processing 90/352: [async_websocket.v0.17.0: http] [dune.3.17.1, dune-configurator.3.17.1: extract] [mingw-w64-shims: sh mingw-w64-shims] [num: patch]
Processing 91/352: [async_websocket.v0.17.0: http] [dune.3.17.1, dune-configurator.3.17.1: extract] [ocaml_intrinsics_kernel.v0.17.1: extract] [mingw-w64-shims: sh mingw-w64-shims] [num: patch]
Processing 91/352: [async_websocket.v0.17.0: http] [dune.3.17.1, dune-configurator.3.17.1: extract] [ocaml_intrinsics_kernel.v0.17.1: extract] [mingw-w64-shims: sh mingw-w64-shims] [num: make opam-modern]
-> retrieved ocaml_intrinsics_kernel.v0.17.1  (cached)
Processing 91/352: [async_websocket.v0.17.0: http] [dune.3.17.1, dune-configurator.3.17.1: extract] [mingw-w64-shims: sh mingw-w64-shims] [num: make opam-modern]
Processing 92/352: [async_websocket.v0.17.0: http] [dune.3.17.1, dune-configurator.3.17.1: extract] [ocamlbuild.0.15.0: extract] [mingw-w64-shims: sh mingw-w64-shims] [num: make opam-modern]
-> retrieved ocamlbuild.0.15.0  (cached)
Processing 92/352: [async_websocket.v0.17.0: http] [dune.3.17.1, dune-configurator.3.17.1: extract] [mingw-w64-shims: sh mingw-w64-shims] [num: make opam-modern]
Processing 93/352: [async_websocket.v0.17.0: http] [dune.3.17.1, dune-configurator.3.17.1: extract] [ocamlfind.1.9.5: extract] [mingw-w64-shims: sh mingw-w64-shims] [num: make opam-modern]
Processing 94/352: [async_websocket.v0.17.0: http] [dune.3.17.1, dune-configurator.3.17.1: extract] [ocamlfind.1.9.5: extract] [mingw-w64-shims: sh mingw-w64-shims] [num: make opam-modern] [ocamlbuild: make configure.make]
-> retrieved dune.3.17.1, dune-configurator.3.17.1  (cached)
Processing 94/352: [async_websocket.v0.17.0: http] [ocamlfind.1.9.5: extract] [mingw-w64-shims: sh mingw-w64-shims] [num: make opam-modern] [ocamlbuild: make configure.make]
Processing 95/352: [async_websocket.v0.17.0: http] [ocamlfind.1.9.5: extract] [parsexp.v0.17.0: extract] [mingw-w64-shims: sh mingw-w64-shims] [num: make opam-modern] [ocamlbuild: make configure.make]
Processing 96/352: [async_websocket.v0.17.0: http] [ocamlfind.1.9.5: extract] [parsexp.v0.17.0: extract] [dune: ocaml 15] [mingw-w64-shims: sh mingw-w64-shims] [num: make opam-modern] [ocamlbuild: make configure.make]
Processing 96/352: [async_websocket.v0.17.0: extract] [ocamlfind.1.9.5: extract] [parsexp.v0.17.0: extract] [dune: ocaml 15] [mingw-w64-shims: sh mingw-w64-shims] [num: make opam-modern] [ocamlbuild: make configure.make]
-> retrieved ocamlfind.1.9.5  (cached)
Processing 96/352: [async_websocket.v0.17.0: extract] [parsexp.v0.17.0: extract] [dune: ocaml 15] [mingw-w64-shims: sh mingw-w64-shims] [num: make opam-modern] [ocamlbuild: make configure.make]
Processing 97/352: [async_websocket.v0.17.0: extract] [parsexp.v0.17.0: extract] [ppx_assert.v0.17.0: extract] [dune: ocaml 15] [mingw-w64-shims: sh mingw-w64-shims] [num: make opam-modern] [ocamlbuild: make configure.make]
[ocamlfind: patch] applying 0001-Fix-bug-when-installing-with-a-system-compiler.patch
Processing 98/352: [async_websocket.v0.17.0: extract] [parsexp.v0.17.0: extract] [ppx_assert.v0.17.0: extract] [dune: ocaml 15] [mingw-w64-shims: sh mingw-w64-shims] [num: make opam-modern] [ocamlbuild: make configure.make] [ocamlfind: patch]
-> retrieved async_websocket.v0.17.0  (https://github.com/janestreet/async_websocket/archive/refs/tags/v0.17.0.tar.gz)
Processing 98/352: [parsexp.v0.17.0: extract] [ppx_assert.v0.17.0: extract] [dune: ocaml 15] [mingw-w64-shims: sh mingw-w64-shims] [num: make opam-modern] [ocamlbuild: make configure.make] [ocamlfind: patch]
Processing 99/352: [parsexp.v0.17.0: extract] [ppx_assert.v0.17.0: extract] [ppx_base.v0.17.0: extract] [dune: ocaml 15] [mingw-w64-shims: sh mingw-w64-shims] [num: make opam-modern] [ocamlbuild: make configure.make] [ocamlfind: patch]
-> retrieved parsexp.v0.17.0  (cached)
Processing 99/352: [ppx_assert.v0.17.0: extract] [ppx_base.v0.17.0: extract] [dune: ocaml 15] [mingw-w64-shims: sh mingw-w64-shims] [num: make opam-modern] [ocamlbuild: make configure.make] [ocamlfind: patch]
Processing 100/352: [ppx_assert.v0.17.0: extract] [ppx_base.v0.17.0: extract] [ppx_bench.v0.17.0: extract] [dune: ocaml 15] [mingw-w64-shims: sh mingw-w64-shims] [num: make opam-modern] [ocamlbuild: make configure.make] [ocamlfind: patch]
-> retrieved ppx_assert.v0.17.0  (cached)
Processing 100/352: [ppx_base.v0.17.0: extract] [ppx_bench.v0.17.0: extract] [dune: ocaml 15] [mingw-w64-shims: sh mingw-w64-shims] [num: make opam-modern] [ocamlbuild: make configure.make] [ocamlfind: patch]
Processing 101/352: [ppx_base.v0.17.0: extract] [ppx_bench.v0.17.0: extract] [ppx_bin_prot.v0.17.0: extract] [dune: ocaml 15] [mingw-w64-shims: sh mingw-w64-shims] [num: make opam-modern] [ocamlbuild: make configure.make] [ocamlfind: patch]
-> retrieved ppx_base.v0.17.0  (cached)
Processing 101/352: [ppx_bench.v0.17.0: extract] [ppx_bin_prot.v0.17.0: extract] [dune: ocaml 15] [mingw-w64-shims: sh mingw-w64-shims] [num: make opam-modern] [ocamlbuild: make configure.make] [ocamlfind: patch]
Processing 102/352: [ppx_bench.v0.17.0: extract] [ppx_bin_prot.v0.17.0: extract] [ppx_cold.v0.17.0: extract] [dune: ocaml 15] [mingw-w64-shims: sh mingw-w64-shims] [num: make opam-modern] [ocamlbuild: make configure.make] [ocamlfind: patch]
-> retrieved ppx_bench.v0.17.0  (cached)
Processing 102/352: [ppx_bin_prot.v0.17.0: extract] [ppx_cold.v0.17.0: extract] [dune: ocaml 15] [mingw-w64-shims: sh mingw-w64-shims] [num: make opam-modern] [ocamlbuild: make configure.make] [ocamlfind: patch]
Processing 103/352: [ppx_bin_prot.v0.17.0: extract] [ppx_cold.v0.17.0: extract] [ppx_compare.v0.17.0: extract] [dune: ocaml 15] [mingw-w64-shims: sh mingw-w64-shims] [num: make opam-modern] [ocamlbuild: make configure.make] [ocamlfind: patch]
-> retrieved ppx_bin_prot.v0.17.0  (cached)
Processing 103/352: [ppx_cold.v0.17.0: extract] [ppx_compare.v0.17.0: extract] [dune: ocaml 15] [mingw-w64-shims: sh mingw-w64-shims] [num: make opam-modern] [ocamlbuild: make configure.make] [ocamlfind: patch]
Processing 104/352: [ppx_cold.v0.17.0: extract] [ppx_compare.v0.17.0: extract] [ppx_custom_printf.v0.17.0: extract] [dune: ocaml 15] [mingw-w64-shims: sh mingw-w64-shims] [num: make opam-modern] [ocamlbuild: make configure.make] [ocamlfind: patch]
-> retrieved ppx_cold.v0.17.0  (cached)
Processing 104/352: [ppx_compare.v0.17.0: extract] [ppx_custom_printf.v0.17.0: extract] [dune: ocaml 15] [mingw-w64-shims: sh mingw-w64-shims] [num: make opam-modern] [ocamlbuild: make configure.make] [ocamlfind: patch]
Processing 105/352: [ppx_compare.v0.17.0: extract] [ppx_custom_printf.v0.17.0: extract] [ppx_derivers.1.2.1: extract] [dune: ocaml 15] [mingw-w64-shims: sh mingw-w64-shims] [num: make opam-modern] [ocamlbuild: make configure.make] [ocamlfind: patch]
-> retrieved ppx_compare.v0.17.0  (cached)
Processing 105/352: [ppx_custom_printf.v0.17.0: extract] [ppx_derivers.1.2.1: extract] [dune: ocaml 15] [mingw-w64-shims: sh mingw-w64-shims] [num: make opam-modern] [ocamlbuild: make configure.make] [ocamlfind: patch]
Processing 106/352: [ppx_custom_printf.v0.17.0: extract] [ppx_derivers.1.2.1: extract] [ppx_diff.v0.17.0: extract] [dune: ocaml 15] [mingw-w64-shims: sh mingw-w64-shims] [num: make opam-modern] [ocamlbuild: make configure.make] [ocamlfind: patch]
-> retrieved ppx_custom_printf.v0.17.0  (cached)
Processing 106/352: [ppx_derivers.1.2.1: extract] [ppx_diff.v0.17.0: extract] [dune: ocaml 15] [mingw-w64-shims: sh mingw-w64-shims] [num: make opam-modern] [ocamlbuild: make configure.make] [ocamlfind: patch]
Processing 107/352: [ppx_derivers.1.2.1: extract] [ppx_diff.v0.17.0: extract] [ppx_disable_unused_warnings.v0.17.0: extract] [dune: ocaml 15] [mingw-w64-shims: sh mingw-w64-shims] [num: make opam-modern] [ocamlbuild: make configure.make] [ocamlfind: patch]
-> retrieved ppx_derivers.1.2.1  (cached)
Processing 107/352: [ppx_diff.v0.17.0: extract] [ppx_disable_unused_warnings.v0.17.0: extract] [dune: ocaml 15] [mingw-w64-shims: sh mingw-w64-shims] [num: make opam-modern] [ocamlbuild: make configure.make] [ocamlfind: patch]
Processing 108/352: [ppx_diff.v0.17.0: extract] [ppx_disable_unused_warnings.v0.17.0: extract] [ppx_enumerate.v0.17.0: extract] [dune: ocaml 15] [mingw-w64-shims: sh mingw-w64-shims] [num: make opam-modern] [ocamlbuild: make configure.make] [ocamlfind: patch]
-> retrieved ppx_diff.v0.17.0  (cached)
Processing 108/352: [ppx_disable_unused_warnings.v0.17.0: extract] [ppx_enumerate.v0.17.0: extract] [dune: ocaml 15] [mingw-w64-shims: sh mingw-w64-shims] [num: make opam-modern] [ocamlbuild: make configure.make] [ocamlfind: patch]
Processing 109/352: [ppx_disable_unused_warnings.v0.17.0: extract] [ppx_enumerate.v0.17.0: extract] [ppx_expect.v0.17.2: extract] [dune: ocaml 15] [mingw-w64-shims: sh mingw-w64-shims] [num: make opam-modern] [ocamlbuild: make configure.make] [ocamlfind: patch]
-> retrieved ppx_disable_unused_warnings.v0.17.0  (cached)
Processing 109/352: [ppx_enumerate.v0.17.0: extract] [ppx_expect.v0.17.2: extract] [dune: ocaml 15] [mingw-w64-shims: sh mingw-w64-shims] [num: make opam-modern] [ocamlbuild: make configure.make] [ocamlfind: patch]
Processing 110/352: [ppx_enumerate.v0.17.0: extract] [ppx_expect.v0.17.2: extract] [ppx_fields_conv.v0.17.0: extract] [dune: ocaml 15] [mingw-w64-shims: sh mingw-w64-shims] [num: make opam-modern] [ocamlbuild: make configure.make] [ocamlfind: patch]
-> retrieved ppx_enumerate.v0.17.0  (cached)
Processing 110/352: [ppx_expect.v0.17.2: extract] [ppx_fields_conv.v0.17.0: extract] [dune: ocaml 15] [mingw-w64-shims: sh mingw-w64-shims] [num: make opam-modern] [ocamlbuild: make configure.make] [ocamlfind: patch]
Processing 111/352: [ppx_expect.v0.17.2: extract] [ppx_fields_conv.v0.17.0: extract] [ppx_fixed_literal.v0.17.0: extract] [dune: ocaml 15] [mingw-w64-shims: sh mingw-w64-shims] [num: make opam-modern] [ocamlbuild: make configure.make] [ocamlfind: patch]
-> retrieved ppx_expect.v0.17.2  (cached)
Processing 111/352: [ppx_fields_conv.v0.17.0: extract] [ppx_fixed_literal.v0.17.0: extract] [dune: ocaml 15] [mingw-w64-shims: sh mingw-w64-shims] [num: make opam-modern] [ocamlbuild: make configure.make] [ocamlfind: patch]
Processing 112/352: [ppx_fields_conv.v0.17.0: extract] [ppx_fixed_literal.v0.17.0: extract] [ppx_globalize.v0.17.0: extract] [dune: ocaml 15] [mingw-w64-shims: sh mingw-w64-shims] [num: make opam-modern] [ocamlbuild: make configure.make] [ocamlfind: patch]
-> retrieved ppx_fields_conv.v0.17.0  (cached)
Processing 112/352: [ppx_fixed_literal.v0.17.0: extract] [ppx_globalize.v0.17.0: extract] [dune: ocaml 15] [mingw-w64-shims: sh mingw-w64-shims] [num: make opam-modern] [ocamlbuild: make configure.make] [ocamlfind: patch]
Processing 113/352: [ppx_fixed_literal.v0.17.0: extract] [ppx_globalize.v0.17.0: extract] [ppx_hash.v0.17.0: extract] [dune: ocaml 15] [mingw-w64-shims: sh mingw-w64-shims] [num: make opam-modern] [ocamlbuild: make configure.make] [ocamlfind: patch]
-> retrieved ppx_fixed_literal.v0.17.0  (cached)
Processing 113/352: [ppx_globalize.v0.17.0: extract] [ppx_hash.v0.17.0: extract] [dune: ocaml 15] [mingw-w64-shims: sh mingw-w64-shims] [num: make opam-modern] [ocamlbuild: make configure.make] [ocamlfind: patch]
Processing 114/352: [ppx_globalize.v0.17.0: extract] [ppx_hash.v0.17.0: extract] [ppx_here.v0.17.0: extract] [dune: ocaml 15] [mingw-w64-shims: sh mingw-w64-shims] [num: make opam-modern] [ocamlbuild: make configure.make] [ocamlfind: patch]
-> retrieved ppx_globalize.v0.17.0  (cached)
Processing 114/352: [ppx_hash.v0.17.0: extract] [ppx_here.v0.17.0: extract] [dune: ocaml 15] [mingw-w64-shims: sh mingw-w64-shims] [num: make opam-modern] [ocamlbuild: make configure.make] [ocamlfind: patch]
Processing 115/352: [ppx_hash.v0.17.0: extract] [ppx_here.v0.17.0: extract] [ppx_ignore_instrumentation.v0.17.0: extract] [dune: ocaml 15] [mingw-w64-shims: sh mingw-w64-shims] [num: make opam-modern] [ocamlbuild: make configure.make] [ocamlfind: patch]
-> retrieved ppx_hash.v0.17.0  (cached)
Processing 115/352: [ppx_here.v0.17.0: extract] [ppx_ignore_instrumentation.v0.17.0: extract] [dune: ocaml 15] [mingw-w64-shims: sh mingw-w64-shims] [num: make opam-modern] [ocamlbuild: make configure.make] [ocamlfind: patch]
Processing 116/352: [ppx_here.v0.17.0: extract] [ppx_ignore_instrumentation.v0.17.0: extract] [ppx_inline_test.v0.17.0: extract] [dune: ocaml 15] [mingw-w64-shims: sh mingw-w64-shims] [num: make opam-modern] [ocamlbuild: make configure.make] [ocamlfind: patch]
-> retrieved ppx_here.v0.17.0  (cached)
Processing 116/352: [ppx_ignore_instrumentation.v0.17.0: extract] [ppx_inline_test.v0.17.0: extract] [dune: ocaml 15] [mingw-w64-shims: sh mingw-w64-shims] [num: make opam-modern] [ocamlbuild: make configure.make] [ocamlfind: patch]
Processing 117/352: [ppx_ignore_instrumentation.v0.17.0: extract] [ppx_inline_test.v0.17.0: extract] [ppx_jane.v0.17.0: extract] [dune: ocaml 15] [mingw-w64-shims: sh mingw-w64-shims] [num: make opam-modern] [ocamlbuild: make configure.make] [ocamlfind: patch]
-> retrieved ppx_ignore_instrumentation.v0.17.0  (cached)
Processing 117/352: [ppx_inline_test.v0.17.0: extract] [ppx_jane.v0.17.0: extract] [dune: ocaml 15] [mingw-w64-shims: sh mingw-w64-shims] [num: make opam-modern] [ocamlbuild: make configure.make] [ocamlfind: patch]
Processing 118/352: [ppx_inline_test.v0.17.0: extract] [ppx_jane.v0.17.0: extract] [ppx_let.v0.17.0: extract] [dune: ocaml 15] [mingw-w64-shims: sh mingw-w64-shims] [num: make opam-modern] [ocamlbuild: make configure.make] [ocamlfind: patch]
-> retrieved ppx_inline_test.v0.17.0  (cached)
Processing 118/352: [ppx_jane.v0.17.0: extract] [ppx_let.v0.17.0: extract] [dune: ocaml 15] [mingw-w64-shims: sh mingw-w64-shims] [num: make opam-modern] [ocamlbuild: make configure.make] [ocamlfind: patch]
Processing 119/352: [ppx_jane.v0.17.0: extract] [ppx_let.v0.17.0: extract] [ppx_log.v0.17.0: extract] [dune: ocaml 15] [mingw-w64-shims: sh mingw-w64-shims] [num: make opam-modern] [ocamlbuild: make configure.make] [ocamlfind: patch]
-> retrieved ppx_jane.v0.17.0  (cached)
Processing 119/352: [ppx_let.v0.17.0: extract] [ppx_log.v0.17.0: extract] [dune: ocaml 15] [mingw-w64-shims: sh mingw-w64-shims] [num: make opam-modern] [ocamlbuild: make configure.make] [ocamlfind: patch]
Processing 120/352: [ppx_let.v0.17.0: extract] [ppx_log.v0.17.0: extract] [ppx_module_timer.v0.17.0: extract] [dune: ocaml 15] [mingw-w64-shims: sh mingw-w64-shims] [num: make opam-modern] [ocamlbuild: make configure.make] [ocamlfind: patch]
-> retrieved ppx_let.v0.17.0  (cached)
Processing 120/352: [ppx_log.v0.17.0: extract] [ppx_module_timer.v0.17.0: extract] [dune: ocaml 15] [mingw-w64-shims: sh mingw-w64-shims] [num: make opam-modern] [ocamlbuild: make configure.make] [ocamlfind: patch]
Processing 121/352: [ppx_log.v0.17.0: extract] [ppx_module_timer.v0.17.0: extract] [ppx_optcomp.v0.17.0: extract] [dune: ocaml 15] [mingw-w64-shims: sh mingw-w64-shims] [num: make opam-modern] [ocamlbuild: make configure.make] [ocamlfind: patch]
-> retrieved ppx_log.v0.17.0  (cached)
Processing 121/352: [ppx_module_timer.v0.17.0: extract] [ppx_optcomp.v0.17.0: extract] [dune: ocaml 15] [mingw-w64-shims: sh mingw-w64-shims] [num: make opam-modern] [ocamlbuild: make configure.make] [ocamlfind: patch]
Processing 122/352: [ppx_module_timer.v0.17.0: extract] [ppx_optcomp.v0.17.0: extract] [ppx_optional.v0.17.0: extract] [dune: ocaml 15] [mingw-w64-shims: sh mingw-w64-shims] [num: make opam-modern] [ocamlbuild: make configure.make] [ocamlfind: patch]
-> retrieved ppx_module_timer.v0.17.0  (cached)
Processing 122/352: [ppx_optcomp.v0.17.0: extract] [ppx_optional.v0.17.0: extract] [dune: ocaml 15] [mingw-w64-shims: sh mingw-w64-shims] [num: make opam-modern] [ocamlbuild: make configure.make] [ocamlfind: patch]
Processing 123/352: [ppx_optcomp.v0.17.0: extract] [ppx_optional.v0.17.0: extract] [ppx_pipebang.v0.17.0: extract] [dune: ocaml 15] [mingw-w64-shims: sh mingw-w64-shims] [num: make opam-modern] [ocamlbuild: make configure.make] [ocamlfind: patch]
-> retrieved ppx_optcomp.v0.17.0  (cached)
Processing 123/352: [ppx_optional.v0.17.0: extract] [ppx_pipebang.v0.17.0: extract] [dune: ocaml 15] [mingw-w64-shims: sh mingw-w64-shims] [num: make opam-modern] [ocamlbuild: make configure.make] [ocamlfind: patch]
Processing 124/352: [ppx_optional.v0.17.0: extract] [ppx_pipebang.v0.17.0: extract] [ppx_sexp_conv.v0.17.0: extract] [dune: ocaml 15] [mingw-w64-shims: sh mingw-w64-shims] [num: make opam-modern] [ocamlbuild: make configure.make] [ocamlfind: patch]
-> retrieved ppx_optional.v0.17.0  (cached)
Processing 124/352: [ppx_pipebang.v0.17.0: extract] [ppx_sexp_conv.v0.17.0: extract] [dune: ocaml 15] [mingw-w64-shims: sh mingw-w64-shims] [num: make opam-modern] [ocamlbuild: make configure.make] [ocamlfind: patch]
Processing 125/352: [ppx_pipebang.v0.17.0: extract] [ppx_sexp_conv.v0.17.0: extract] [ppx_sexp_message.v0.17.0: extract] [dune: ocaml 15] [mingw-w64-shims: sh mingw-w64-shims] [num: make opam-modern] [ocamlbuild: make configure.make] [ocamlfind: patch]
-> retrieved ppx_pipebang.v0.17.0  (cached)
Processing 125/352: [ppx_sexp_conv.v0.17.0: extract] [ppx_sexp_message.v0.17.0: extract] [dune: ocaml 15] [mingw-w64-shims: sh mingw-w64-shims] [num: make opam-modern] [ocamlbuild: make configure.make] [ocamlfind: patch]
Processing 126/352: [ppx_sexp_conv.v0.17.0: extract] [ppx_sexp_message.v0.17.0: extract] [ppx_sexp_value.v0.17.0: extract] [dune: ocaml 15] [mingw-w64-shims: sh mingw-w64-shims] [num: make opam-modern] [ocamlbuild: make configure.make] [ocamlfind: patch]
-> retrieved ppx_sexp_conv.v0.17.0  (cached)
Processing 126/352: [ppx_sexp_message.v0.17.0: extract] [ppx_sexp_value.v0.17.0: extract] [dune: ocaml 15] [mingw-w64-shims: sh mingw-w64-shims] [num: make opam-modern] [ocamlbuild: make configure.make] [ocamlfind: patch]
Processing 127/352: [ppx_sexp_message.v0.17.0: extract] [ppx_sexp_value.v0.17.0: extract] [ppx_stable.v0.17.0: extract] [dune: ocaml 15] [mingw-w64-shims: sh mingw-w64-shims] [num: make opam-modern] [ocamlbuild: make configure.make] [ocamlfind: patch]
-> retrieved ppx_sexp_message.v0.17.0  (cached)
Processing 127/352: [ppx_sexp_value.v0.17.0: extract] [ppx_stable.v0.17.0: extract] [dune: ocaml 15] [mingw-w64-shims: sh mingw-w64-shims] [num: make opam-modern] [ocamlbuild: make configure.make] [ocamlfind: patch]
Processing 128/352: [ppx_sexp_value.v0.17.0: extract] [ppx_stable.v0.17.0: extract] [ppx_stable_witness.v0.17.0: extract] [dune: ocaml 15] [mingw-w64-shims: sh mingw-w64-shims] [num: make opam-modern] [ocamlbuild: make configure.make] [ocamlfind: patch]
-> retrieved ppx_sexp_value.v0.17.0  (cached)
Processing 128/352: [ppx_stable.v0.17.0: extract] [ppx_stable_witness.v0.17.0: extract] [dune: ocaml 15] [mingw-w64-shims: sh mingw-w64-shims] [num: make opam-modern] [ocamlbuild: make configure.make] [ocamlfind: patch]
Processing 129/352: [ppx_stable.v0.17.0: extract] [ppx_stable_witness.v0.17.0: extract] [ppx_string.v0.17.0: extract] [dune: ocaml 15] [mingw-w64-shims: sh mingw-w64-shims] [num: make opam-modern] [ocamlbuild: make configure.make] [ocamlfind: patch]
-> retrieved ppx_stable.v0.17.0  (cached)
Processing 129/352: [ppx_stable_witness.v0.17.0: extract] [ppx_string.v0.17.0: extract] [dune: ocaml 15] [mingw-w64-shims: sh mingw-w64-shims] [num: make opam-modern] [ocamlbuild: make configure.make] [ocamlfind: patch]
Processing 130/352: [ppx_stable_witness.v0.17.0: extract] [ppx_string.v0.17.0: extract] [ppx_string_conv.v0.17.0: extract] [dune: ocaml 15] [mingw-w64-shims: sh mingw-w64-shims] [num: make opam-modern] [ocamlbuild: make configure.make] [ocamlfind: patch]
-> retrieved ppx_stable_witness.v0.17.0  (cached)
Processing 130/352: [ppx_string.v0.17.0: extract] [ppx_string_conv.v0.17.0: extract] [dune: ocaml 15] [mingw-w64-shims: sh mingw-w64-shims] [num: make opam-modern] [ocamlbuild: make configure.make] [ocamlfind: patch]
Processing 131/352: [ppx_string.v0.17.0: extract] [ppx_string_conv.v0.17.0: extract] [ppx_tydi.v0.17.0: extract] [dune: ocaml 15] [mingw-w64-shims: sh mingw-w64-shims] [num: make opam-modern] [ocamlbuild: make configure.make] [ocamlfind: patch]
-> retrieved ppx_string.v0.17.0  (cached)
Processing 131/352: [ppx_string_conv.v0.17.0: extract] [ppx_tydi.v0.17.0: extract] [dune: ocaml 15] [mingw-w64-shims: sh mingw-w64-shims] [num: make opam-modern] [ocamlbuild: make configure.make] [ocamlfind: patch]
Processing 132/352: [ppx_string_conv.v0.17.0: extract] [ppx_tydi.v0.17.0: extract] [ppx_typerep_conv.v0.17.0: extract] [dune: ocaml 15] [mingw-w64-shims: sh mingw-w64-shims] [num: make opam-modern] [ocamlbuild: make configure.make] [ocamlfind: patch]
-> retrieved ppx_string_conv.v0.17.0  (cached)
Processing 132/352: [ppx_tydi.v0.17.0: extract] [ppx_typerep_conv.v0.17.0: extract] [dune: ocaml 15] [mingw-w64-shims: sh mingw-w64-shims] [num: make opam-modern] [ocamlbuild: make configure.make] [ocamlfind: patch]
Processing 133/352: [ppx_tydi.v0.17.0: extract] [ppx_typerep_conv.v0.17.0: extract] [ppx_variants_conv.v0.17.0: extract] [dune: ocaml 15] [mingw-w64-shims: sh mingw-w64-shims] [num: make opam-modern] [ocamlbuild: make configure.make] [ocamlfind: patch]
-> retrieved ppx_tydi.v0.17.0  (cached)
Processing 133/352: [ppx_typerep_conv.v0.17.0: extract] [ppx_variants_conv.v0.17.0: extract] [dune: ocaml 15] [mingw-w64-shims: sh mingw-w64-shims] [num: make opam-modern] [ocamlbuild: make configure.make] [ocamlfind: patch]
Processing 134/352: [ppx_typerep_conv.v0.17.0: extract] [ppx_variants_conv.v0.17.0: extract] [ppxlib.0.34.0: extract] [dune: ocaml 15] [mingw-w64-shims: sh mingw-w64-shims] [num: make opam-modern] [ocamlbuild: make configure.make] [ocamlfind: patch]
-> retrieved ppx_typerep_conv.v0.17.0  (cached)
Processing 134/352: [ppx_variants_conv.v0.17.0: extract] [ppxlib.0.34.0: extract] [dune: ocaml 15] [mingw-w64-shims: sh mingw-w64-shims] [num: make opam-modern] [ocamlbuild: make configure.make] [ocamlfind: patch]
Processing 135/352: [ppx_variants_conv.v0.17.0: extract] [ppxlib.0.34.0: extract] [ppxlib_jane.v0.17.2: extract] [dune: ocaml 15] [mingw-w64-shims: sh mingw-w64-shims] [num: make opam-modern] [ocamlbuild: make configure.make] [ocamlfind: patch]
-> retrieved ppx_variants_conv.v0.17.0  (cached)
Processing 135/352: [ppxlib.0.34.0: extract] [ppxlib_jane.v0.17.2: extract] [dune: ocaml 15] [mingw-w64-shims: sh mingw-w64-shims] [num: make opam-modern] [ocamlbuild: make configure.make] [ocamlfind: patch]
Processing 136/352: [ppxlib.0.34.0: extract] [ppxlib_jane.v0.17.2: extract] [protocol_version_header.v0.17.0: extract] [dune: ocaml 15] [mingw-w64-shims: sh mingw-w64-shims] [num: make opam-modern] [ocamlbuild: make configure.make] [ocamlfind: patch]
-> retrieved ppxlib_jane.v0.17.2  (cached)
Processing 136/352: [ppxlib.0.34.0: extract] [protocol_version_header.v0.17.0: extract] [dune: ocaml 15] [mingw-w64-shims: sh mingw-w64-shims] [num: make opam-modern] [ocamlbuild: make configure.make] [ocamlfind: patch]
Processing 137/352: [ppxlib.0.34.0: extract] [protocol_version_header.v0.17.0: extract] [re.1.12.0: extract] [dune: ocaml 15] [mingw-w64-shims: sh mingw-w64-shims] [num: make opam-modern] [ocamlbuild: make configure.make] [ocamlfind: patch]
-> retrieved protocol_version_header.v0.17.0  (cached)
Processing 137/352: [ppxlib.0.34.0: extract] [re.1.12.0: extract] [dune: ocaml 15] [mingw-w64-shims: sh mingw-w64-shims] [num: make opam-modern] [ocamlbuild: make configure.make] [ocamlfind: patch]
Processing 138/352: [ppxlib.0.34.0: extract] [re.1.12.0: extract] [re2.v0.17.0: http] [dune: ocaml 15] [mingw-w64-shims: sh mingw-w64-shims] [num: make opam-modern] [ocamlbuild: make configure.make] [ocamlfind: patch]
-> retrieved ppxlib.0.34.0  (cached)
Processing 138/352: [re.1.12.0: extract] [re2.v0.17.0: http] [dune: ocaml 15] [mingw-w64-shims: sh mingw-w64-shims] [num: make opam-modern] [ocamlbuild: make configure.make] [ocamlfind: patch]
Processing 139/352: [re.1.12.0: extract] [re2.v0.17.0: http] [regex_parser_intf.v0.17.0: http] [dune: ocaml 15] [mingw-w64-shims: sh mingw-w64-shims] [num: make opam-modern] [ocamlbuild: make configure.make] [ocamlfind: patch]
-> retrieved re.1.12.0  (cached)
Processing 139/352: [re2.v0.17.0: http] [regex_parser_intf.v0.17.0: http] [dune: ocaml 15] [mingw-w64-shims: sh mingw-w64-shims] [num: make opam-modern] [ocamlbuild: make configure.make] [ocamlfind: patch]
-> retrieved seq.base  (cached)
Processing 140/352: [re2.v0.17.0: http] [regex_parser_intf.v0.17.0: http] [dune: ocaml 15] [mingw-w64-shims: sh mingw-w64-shims] [num: make opam-modern] [ocamlbuild: make configure.make] [ocamlfind: patch]
Processing 141/352: [re2.v0.17.0: http] [regex_parser_intf.v0.17.0: http] [sexp_pretty.v0.17.0: extract] [dune: ocaml 15] [mingw-w64-shims: sh mingw-w64-shims] [num: make opam-modern] [ocamlbuild: make configure.make] [ocamlfind: patch]
Processing 142/352: [re2.v0.17.0: http] [regex_parser_intf.v0.17.0: http] [sexp_pretty.v0.17.0: extract] [dune: ocaml 15] [mingw-w64-shims: sh mingw-w64-shims] [num: make opam-modern] [ocamlbuild: make configure.make] [ocamlfind: patch]
-> installed seq.base
Processing 143/352: [re2.v0.17.0: http] [regex_parser_intf.v0.17.0: http] [sexp_pretty.v0.17.0: extract] [dune: ocaml 15] [mingw-w64-shims: sh mingw-w64-shims] [num: make opam-modern] [ocamlbuild: make configure.make] [ocamlfind: patch]
Processing 143/352: [re2.v0.17.0: extract] [regex_parser_intf.v0.17.0: http] [sexp_pretty.v0.17.0: extract] [dune: ocaml 15] [mingw-w64-shims: sh mingw-w64-shims] [num: make opam-modern] [ocamlbuild: make configure.make] [ocamlfind: patch]
-> retrieved sexp_pretty.v0.17.0  (cached)
Processing 143/352: [re2.v0.17.0: extract] [regex_parser_intf.v0.17.0: http] [dune: ocaml 15] [mingw-w64-shims: sh mingw-w64-shims] [num: make opam-modern] [ocamlbuild: make configure.make] [ocamlfind: patch]
Processing 144/352: [re2.v0.17.0: extract] [regex_parser_intf.v0.17.0: http] [sexplib.v0.17.0: extract] [dune: ocaml 15] [mingw-w64-shims: sh mingw-w64-shims] [num: make opam-modern] [ocamlbuild: make configure.make] [ocamlfind: patch]
Processing 144/352: [re2.v0.17.0: extract] [regex_parser_intf.v0.17.0: extract] [sexplib.v0.17.0: extract] [dune: ocaml 15] [mingw-w64-shims: sh mingw-w64-shims] [num: make opam-modern] [ocamlbuild: make configure.make] [ocamlfind: patch]
-> retrieved re2.v0.17.0  (https://github.com/janestreet/re2/archive/refs/tags/v0.17.0.tar.gz)
Processing 144/352: [regex_parser_intf.v0.17.0: extract] [sexplib.v0.17.0: extract] [dune: ocaml 15] [mingw-w64-shims: sh mingw-w64-shims] [num: make opam-modern] [ocamlbuild: make configure.make] [ocamlfind: patch]
Processing 145/352: [regex_parser_intf.v0.17.0: extract] [sexplib.v0.17.0: extract] [sexplib0.v0.17.0: extract] [dune: ocaml 15] [mingw-w64-shims: sh mingw-w64-shims] [num: make opam-modern] [ocamlbuild: make configure.make] [ocamlfind: patch]
-> retrieved regex_parser_intf.v0.17.0  (https://github.com/janestreet/regex_parser_intf/archive/refs/tags/v0.17.0.tar.gz)
Processing 145/352: [sexplib.v0.17.0: extract] [sexplib0.v0.17.0: extract] [dune: ocaml 15] [mingw-w64-shims: sh mingw-w64-shims] [num: make opam-modern] [ocamlbuild: make configure.make] [ocamlfind: patch]
Processing 146/352: [sexplib.v0.17.0: extract] [sexplib0.v0.17.0: extract] [shuttle_http.0.12.0, shuttle_websocket.0.12.0: http] [dune: ocaml 15] [mingw-w64-shims: sh mingw-w64-shims] [num: make opam-modern] [ocamlbuild: make configure.make] [ocamlfind: patch]
-> retrieved sexplib.v0.17.0  (cached)
Processing 146/352: [sexplib0.v0.17.0: extract] [shuttle_http.0.12.0, shuttle_websocket.0.12.0: http] [dune: ocaml 15] [mingw-w64-shims: sh mingw-w64-shims] [num: make opam-modern] [ocamlbuild: make configure.make] [ocamlfind: patch]
Processing 147/352: [sexplib0.v0.17.0: extract] [shuttle_http.0.12.0, shuttle_websocket.0.12.0: http] [spawn.v0.17.0: extract] [dune: ocaml 15] [mingw-w64-shims: sh mingw-w64-shims] [num: make opam-modern] [ocamlbuild: make configure.make] [ocamlfind: patch]
-> retrieved sexplib0.v0.17.0  (cached)
Processing 147/352: [shuttle_http.0.12.0, shuttle_websocket.0.12.0: http] [spawn.v0.17.0: extract] [dune: ocaml 15] [mingw-w64-shims: sh mingw-w64-shims] [num: make opam-modern] [ocamlbuild: make configure.make] [ocamlfind: patch]
Processing 148/352: [shuttle_http.0.12.0, shuttle_websocket.0.12.0: http] [spawn.v0.17.0: extract] [splittable_random.v0.17.0: extract] [dune: ocaml 15] [mingw-w64-shims: sh mingw-w64-shims] [num: make opam-modern] [ocamlbuild: make configure.make] [ocamlfind: patch]
-> retrieved spawn.v0.17.0  (cached)
Processing 148/352: [shuttle_http.0.12.0, shuttle_websocket.0.12.0: http] [splittable_random.v0.17.0: extract] [dune: ocaml 15] [mingw-w64-shims: sh mingw-w64-shims] [num: make opam-modern] [ocamlbuild: make configure.make] [ocamlfind: patch]
Processing 149/352: [shuttle_http.0.12.0, shuttle_websocket.0.12.0: http] [splittable_random.v0.17.0: extract] [stdio.v0.17.0: extract] [dune: ocaml 15] [mingw-w64-shims: sh mingw-w64-shims] [num: make opam-modern] [ocamlbuild: make configure.make] [ocamlfind: patch]
-> retrieved splittable_random.v0.17.0  (cached)
Processing 149/352: [shuttle_http.0.12.0, shuttle_websocket.0.12.0: http] [stdio.v0.17.0: extract] [dune: ocaml 15] [mingw-w64-shims: sh mingw-w64-shims] [num: make opam-modern] [ocamlbuild: make configure.make] [ocamlfind: patch]
Processing 150/352: [shuttle_http.0.12.0, shuttle_websocket.0.12.0: http] [stdio.v0.17.0: extract] [stdlib-shims.0.3.0: extract] [dune: ocaml 15] [mingw-w64-shims: sh mingw-w64-shims] [num: make opam-modern] [ocamlbuild: make configure.make] [ocamlfind: patch]
Processing 150/352: [shuttle_http.0.12.0, shuttle_websocket.0.12.0: extract] [stdio.v0.17.0: extract] [stdlib-shims.0.3.0: extract] [dune: ocaml 15] [mingw-w64-shims: sh mingw-w64-shims] [num: make opam-modern] [ocamlbuild: make configure.make] [ocamlfind: patch]
-> retrieved stdio.v0.17.0  (cached)
Processing 150/352: [shuttle_http.0.12.0, shuttle_websocket.0.12.0: extract] [stdlib-shims.0.3.0: extract] [dune: ocaml 15] [mingw-w64-shims: sh mingw-w64-shims] [num: make opam-modern] [ocamlbuild: make configure.make] [ocamlfind: patch]
Processing 151/352: [shuttle_http.0.12.0, shuttle_websocket.0.12.0: extract] [stdlib-shims.0.3.0: extract] [textutils.v0.17.0: extract] [dune: ocaml 15] [mingw-w64-shims: sh mingw-w64-shims] [num: make opam-modern] [ocamlbuild: make configure.make] [ocamlfind: patch]
-> retrieved shuttle_http.0.12.0, shuttle_websocket.0.12.0  (https://github.com/anuragsoni/shuttle_http/releases/download/0.12.0/shuttle_http-0.12.0.tbz)
Processing 151/352: [stdlib-shims.0.3.0: extract] [textutils.v0.17.0: extract] [dune: ocaml 15] [mingw-w64-shims: sh mingw-w64-shims] [num: make opam-modern] [ocamlbuild: make configure.make] [ocamlfind: patch]
Processing 152/352: [stdlib-shims.0.3.0: extract] [textutils.v0.17.0: extract] [time_now.v0.17.0: extract] [dune: ocaml 15] [mingw-w64-shims: sh mingw-w64-shims] [num: make opam-modern] [ocamlbuild: make configure.make] [ocamlfind: patch]
-> retrieved stdlib-shims.0.3.0  (cached)
Processing 152/352: [textutils.v0.17.0: extract] [time_now.v0.17.0: extract] [dune: ocaml 15] [mingw-w64-shims: sh mingw-w64-shims] [num: make opam-modern] [ocamlbuild: make configure.make] [ocamlfind: patch]
Processing 153/352: [textutils.v0.17.0: extract] [time_now.v0.17.0: extract] [timezone.v0.17.0: extract] [dune: ocaml 15] [mingw-w64-shims: sh mingw-w64-shims] [num: make opam-modern] [ocamlbuild: make configure.make] [ocamlfind: patch]
-> retrieved textutils.v0.17.0  (cached)
Processing 153/352: [time_now.v0.17.0: extract] [timezone.v0.17.0: extract] [dune: ocaml 15] [mingw-w64-shims: sh mingw-w64-shims] [num: make opam-modern] [ocamlbuild: make configure.make] [ocamlfind: patch]
Processing 154/352: [time_now.v0.17.0: extract] [timezone.v0.17.0: extract] [topkg.1.0.7: extract] [dune: ocaml 15] [mingw-w64-shims: sh mingw-w64-shims] [num: make opam-modern] [ocamlbuild: make configure.make] [ocamlfind: patch]
-> retrieved time_now.v0.17.0  (cached)
Processing 154/352: [timezone.v0.17.0: extract] [topkg.1.0.7: extract] [dune: ocaml 15] [mingw-w64-shims: sh mingw-w64-shims] [num: make opam-modern] [ocamlbuild: make configure.make] [ocamlfind: patch]
Processing 155/352: [timezone.v0.17.0: extract] [topkg.1.0.7: extract] [typerep.v0.17.1: http] [dune: ocaml 15] [mingw-w64-shims: sh mingw-w64-shims] [num: make opam-modern] [ocamlbuild: make configure.make] [ocamlfind: patch]
-> retrieved timezone.v0.17.0  (cached)
Processing 155/352: [topkg.1.0.7: extract] [typerep.v0.17.1: http] [dune: ocaml 15] [mingw-w64-shims: sh mingw-w64-shims] [num: make opam-modern] [ocamlbuild: make configure.make] [ocamlfind: patch]
Processing 156/352: [topkg.1.0.7: extract] [typerep.v0.17.1: http] [uopt.v0.17.0: extract] [dune: ocaml 15] [mingw-w64-shims: sh mingw-w64-shims] [num: make opam-modern] [ocamlbuild: make configure.make] [ocamlfind: patch]
+ C:\cygwin64\bin\sh.exe "./gen_config.sh" "mingw-w64-shims" "i686-binutils" "i686-gcc-core" "i686-gcc-g++-true" "x86_64-binutils" "x86_64-gcc-core" "x86_64-gcc-g++-true" "pkgconf" (CWD=C:\Users\opam\AppData\Local\opam\5.3\.opam-switch\build\mingw-w64-shims.0.2.0)
-> compiled  mingw-w64-shims.0.2.0
Processing 156/352: [topkg.1.0.7: extract] [typerep.v0.17.1: http] [uopt.v0.17.0: extract] [dune: ocaml 15] [num: make opam-modern] [ocamlbuild: make configure.make] [ocamlfind: patch]
-> installed mingw-w64-shims.0.2.0
Processing 157/352: [topkg.1.0.7: extract] [typerep.v0.17.1: http] [uopt.v0.17.0: extract] [dune: ocaml 15] [num: make opam-modern] [ocamlbuild: make configure.make] [ocamlfind: patch]
-> retrieved topkg.1.0.7  (cached)
Processing 157/352: [typerep.v0.17.1: http] [uopt.v0.17.0: extract] [dune: ocaml 15] [num: make opam-modern] [ocamlbuild: make configure.make] [ocamlfind: patch]
Processing 158/352: [typerep.v0.17.1: http] [uopt.v0.17.0: extract] [uutf.1.0.3: extract] [dune: ocaml 15] [num: make opam-modern] [ocamlbuild: make configure.make] [ocamlfind: patch]
Processing 158/352: [typerep.v0.17.1: extract] [uopt.v0.17.0: extract] [uutf.1.0.3: extract] [dune: ocaml 15] [num: make opam-modern] [ocamlbuild: make configure.make] [ocamlfind: patch]
-> retrieved uopt.v0.17.0  (cached)
Processing 158/352: [typerep.v0.17.1: extract] [uutf.1.0.3: extract] [dune: ocaml 15] [num: make opam-modern] [ocamlbuild: make configure.make] [ocamlfind: patch]
Processing 159/352: [typerep.v0.17.1: extract] [uutf.1.0.3: extract] [variantslib.v0.17.0: extract] [dune: ocaml 15] [num: make opam-modern] [ocamlbuild: make configure.make] [ocamlfind: patch]
-> retrieved typerep.v0.17.1  (https://github.com/janestreet/typerep/archive/refs/tags/v0.17.1.tar.gz)
Processing 159/352: [uutf.1.0.3: extract] [variantslib.v0.17.0: extract] [dune: ocaml 15] [num: make opam-modern] [ocamlbuild: make configure.make] [ocamlfind: patch]
Processing 160/352: [uutf.1.0.3: extract] [variantslib.v0.17.0: extract] [zarith.1.14: extract] [dune: ocaml 15] [num: make opam-modern] [ocamlbuild: make configure.make] [ocamlfind: patch]
-> retrieved uutf.1.0.3  (cached)
Processing 160/352: [variantslib.v0.17.0: extract] [zarith.1.14: extract] [dune: ocaml 15] [num: make opam-modern] [ocamlbuild: make configure.make] [ocamlfind: patch]
-> retrieved variantslib.v0.17.0  (cached)
Processing 160/352: [zarith.1.14: extract] [dune: ocaml 15] [num: make opam-modern] [ocamlbuild: make configure.make] [ocamlfind: patch]
+ C:\Users\opam\AppData\Local\opam\5.3\bin\ocaml.exe "boot/bootstrap.ml" "-j" "15" (CWD=C:\Users\opam\AppData\Local\opam\5.3\.opam-switch\build\dune.3.17.1)
- ocamlc -output-complete-exe -w -24 -g -o .duneboot.exe -I boot -I +unix unix.cma boot/libs.ml boot/duneboot.ml
- .\.duneboot.exe -j 15
- cd _boot && C:\Users\opam\AppData\Local\opam\5.3\bin\ocamlopt.opt.exe -c -g -no-alias-deps -w -49-6 -alert -unstable -I +unix -I +threads ocamlc_loc.mli
- File "otherlibs/ocamlc-loc/src\\ocamlc_loc.mli", line 1, characters 4-9:

- Warning 53 [misplaced-attribute]: the "alert" attribute cannot appear in this context

- cd _boot && C:\Users\opam\AppData\Local\opam\5.3\bin\ocamlopt.opt.exe -c -g -no-alias-deps -w -49-6 -alert -unstable -I +unix -I +threads dune_re__Color_map.ml
- x86_64-w64-mingw32-gcc: fatal error: cannot execute 'as': spawn: No such file or directory
- compilation terminated.
- File "dune_re__Color_map.ml", line 1:

- Error: Assembler error, input left in file "C:\Users\opam\AppData\Local\Temp\camlasmb9b499.s"

- 


Processing 160/352: [zarith.1.14: extract] [num: make opam-modern] [ocamlbuild: make configure.make] [ocamlfind: patch]
[ERROR] The compilation of dune.3.17.1 failed at "ocaml boot/bootstrap.ml -j 15".
Processing 161/352: [zarith.1.14: extract] [num: make opam-modern] [ocamlbuild: make configure.make] [ocamlfind: patch]
Processing 162/352: [zarith.1.14: extract] [num: make opam-modern] [ocamlbuild: make configure.make] [ocamlfind: patch]
Processing 163/352: [zarith.1.14: extract] [num: make opam-modern] [ocamlbuild: make configure.make] [ocamlfind: patch]
Processing 164/352: [zarith.1.14: extract] [num: make opam-modern] [ocamlbuild: make configure.make] [ocamlfind: patch]
Processing 165/352: [zarith.1.14: extract] [num: make opam-modern] [ocamlbuild: make configure.make] [ocamlfind: patch]
Processing 166/352: [zarith.1.14: extract] [num: make opam-modern] [ocamlbuild: make configure.make] [ocamlfind: patch]
Processing 167/352: [zarith.1.14: extract] [num: make opam-modern] [ocamlbuild: make configure.make] [ocamlfind: patch]
Processing 168/352: [zarith.1.14: extract] [num: make opam-modern] [ocamlbuild: make configure.make] [ocamlfind: patch]
Processing 169/352: [zarith.1.14: extract] [num: make opam-modern] [ocamlbuild: make configure.make] [ocamlfind: patch]
Processing 170/352: [zarith.1.14: extract] [num: make opam-modern] [ocamlbuild: make configure.make] [ocamlfind: patch]
Processing 171/352: [zarith.1.14: extract] [num: make opam-modern] [ocamlbuild: make configure.make] [ocamlfind: patch]
Processing 172/352: [zarith.1.14: extract] [num: make opam-modern] [ocamlbuild: make configure.make] [ocamlfind: patch]
Processing 173/352: [zarith.1.14: extract] [num: make opam-modern] [ocamlbuild: make configure.make] [ocamlfind: patch]
Processing 174/352: [zarith.1.14: extract] [num: make opam-modern] [ocamlbuild: make configure.make] [ocamlfind: patch]
Processing 175/352: [zarith.1.14: extract] [num: make opam-modern] [ocamlbuild: make configure.make] [ocamlfind: patch]
Processing 176/352: [zarith.1.14: extract] [num: make opam-modern] [ocamlbuild: make configure.make] [ocamlfind: patch]
Processing 177/352: [zarith.1.14: extract] [num: make opam-modern] [ocamlbuild: make configure.make] [ocamlfind: patch]
Processing 178/352: [zarith.1.14: extract] [num: make opam-modern] [ocamlbuild: make configure.make] [ocamlfind: patch]
Processing 179/352: [zarith.1.14: extract] [num: make opam-modern] [ocamlbuild: make configure.make] [ocamlfind: patch]
Processing 180/352: [zarith.1.14: extract] [num: make opam-modern] [ocamlbuild: make configure.make] [ocamlfind: patch]
Processing 181/352: [zarith.1.14: extract] [num: make opam-modern] [ocamlbuild: make configure.make] [ocamlfind: patch]
Processing 182/352: [zarith.1.14: extract] [num: make opam-modern] [ocamlbuild: make configure.make] [ocamlfind: patch]
Processing 183/352: [zarith.1.14: extract] [num: make opam-modern] [ocamlbuild: make configure.make] [ocamlfind: patch]
Processing 184/352: [zarith.1.14: extract] [num: make opam-modern] [ocamlbuild: make configure.make] [ocamlfind: patch]
Processing 185/352: [zarith.1.14: extract] [num: make opam-modern] [ocamlbuild: make configure.make] [ocamlfind: patch]
Processing 186/352: [zarith.1.14: extract] [num: make opam-modern] [ocamlbuild: make configure.make] [ocamlfind: patch]
Processing 187/352: [zarith.1.14: extract] [num: make opam-modern] [ocamlbuild: make configure.make] [ocamlfind: patch]
Processing 188/352: [zarith.1.14: extract] [num: make opam-modern] [ocamlbuild: make configure.make] [ocamlfind: patch]
Processing 189/352: [zarith.1.14: extract] [num: make opam-modern] [ocamlbuild: make configure.make] [ocamlfind: patch]
Processing 190/352: [zarith.1.14: extract] [num: make opam-modern] [ocamlbuild: make configure.make] [ocamlfind: patch]
Processing 191/352: [zarith.1.14: extract] [num: make opam-modern] [ocamlbuild: make configure.make] [ocamlfind: patch]
Processing 192/352: [zarith.1.14: extract] [num: make opam-modern] [ocamlbuild: make configure.make] [ocamlfind: patch]
Processing 193/352: [zarith.1.14: extract] [num: make opam-modern] [ocamlbuild: make configure.make] [ocamlfind: patch]
Processing 194/352: [zarith.1.14: extract] [num: make opam-modern] [ocamlbuild: make configure.make] [ocamlfind: patch]
Processing 195/352: [zarith.1.14: extract] [num: make opam-modern] [ocamlbuild: make configure.make] [ocamlfind: patch]
Processing 196/352: [zarith.1.14: extract] [num: make opam-modern] [ocamlbuild: make configure.make] [ocamlfind: patch]
Processing 197/352: [zarith.1.14: extract] [num: make opam-modern] [ocamlbuild: make configure.make] [ocamlfind: patch]
Processing 198/352: [zarith.1.14: extract] [num: make opam-modern] [ocamlbuild: make configure.make] [ocamlfind: patch]
Processing 199/352: [zarith.1.14: extract] [num: make opam-modern] [ocamlbuild: make configure.make] [ocamlfind: patch]
Processing 200/352: [zarith.1.14: extract] [num: make opam-modern] [ocamlbuild: make configure.make] [ocamlfind: patch]
Processing 201/352: [zarith.1.14: extract] [num: make opam-modern] [ocamlbuild: make configure.make] [ocamlfind: patch]
Processing 202/352: [zarith.1.14: extract] [num: make opam-modern] [ocamlbuild: make configure.make] [ocamlfind: patch]
Processing 203/352: [zarith.1.14: extract] [num: make opam-modern] [ocamlbuild: make configure.make] [ocamlfind: patch]
Processing 204/352: [zarith.1.14: extract] [num: make opam-modern] [ocamlbuild: make configure.make] [ocamlfind: patch]
Processing 205/352: [zarith.1.14: extract] [num: make opam-modern] [ocamlbuild: make configure.make] [ocamlfind: patch]
Processing 206/352: [zarith.1.14: extract] [num: make opam-modern] [ocamlbuild: make configure.make] [ocamlfind: patch]
Processing 207/352: [zarith.1.14: extract] [num: make opam-modern] [ocamlbuild: make configure.make] [ocamlfind: patch]
Processing 208/352: [zarith.1.14: extract] [num: make opam-modern] [ocamlbuild: make configure.make] [ocamlfind: patch]
Processing 209/352: [zarith.1.14: extract] [num: make opam-modern] [ocamlbuild: make configure.make] [ocamlfind: patch]
Processing 210/352: [zarith.1.14: extract] [num: make opam-modern] [ocamlbuild: make configure.make] [ocamlfind: patch]
Processing 211/352: [zarith.1.14: extract] [num: make opam-modern] [ocamlbuild: make configure.make] [ocamlfind: patch]
Processing 212/352: [zarith.1.14: extract] [num: make opam-modern] [ocamlbuild: make configure.make] [ocamlfind: patch]
Processing 213/352: [zarith.1.14: extract] [num: make opam-modern] [ocamlbuild: make configure.make] [ocamlfind: patch]
Processing 214/352: [zarith.1.14: extract] [num: make opam-modern] [ocamlbuild: make configure.make] [ocamlfind: patch]
Processing 215/352: [zarith.1.14: extract] [num: make opam-modern] [ocamlbuild: make configure.make] [ocamlfind: patch]
Processing 216/352: [zarith.1.14: extract] [num: make opam-modern] [ocamlbuild: make configure.make] [ocamlfind: patch]
Processing 217/352: [zarith.1.14: extract] [num: make opam-modern] [ocamlbuild: make configure.make] [ocamlfind: patch]
Processing 218/352: [zarith.1.14: extract] [num: make opam-modern] [ocamlbuild: make configure.make] [ocamlfind: patch]
Processing 219/352: [zarith.1.14: extract] [num: make opam-modern] [ocamlbuild: make configure.make] [ocamlfind: patch]
Processing 220/352: [zarith.1.14: extract] [num: make opam-modern] [ocamlbuild: make configure.make] [ocamlfind: patch]
Processing 221/352: [zarith.1.14: extract] [num: make opam-modern] [ocamlbuild: make configure.make] [ocamlfind: patch]
Processing 222/352: [zarith.1.14: extract] [num: make opam-modern] [ocamlbuild: make configure.make] [ocamlfind: patch]
Processing 223/352: [zarith.1.14: extract] [num: make opam-modern] [ocamlbuild: make configure.make] [ocamlfind: patch]
Processing 224/352: [zarith.1.14: extract] [num: make opam-modern] [ocamlbuild: make configure.make] [ocamlfind: patch]
Processing 225/352: [zarith.1.14: extract] [num: make opam-modern] [ocamlbuild: make configure.make] [ocamlfind: patch]
Processing 226/352: [zarith.1.14: extract] [num: make opam-modern] [ocamlbuild: make configure.make] [ocamlfind: patch]
Processing 227/352: [zarith.1.14: extract] [num: make opam-modern] [ocamlbuild: make configure.make] [ocamlfind: patch]
Processing 228/352: [zarith.1.14: extract] [num: make opam-modern] [ocamlbuild: make configure.make] [ocamlfind: patch]
Processing 229/352: [zarith.1.14: extract] [num: make opam-modern] [ocamlbuild: make configure.make] [ocamlfind: patch]
Processing 230/352: [zarith.1.14: extract] [num: make opam-modern] [ocamlbuild: make configure.make] [ocamlfind: patch]
Processing 231/352: [zarith.1.14: extract] [num: make opam-modern] [ocamlbuild: make configure.make] [ocamlfind: patch]
Processing 232/352: [zarith.1.14: extract] [num: make opam-modern] [ocamlbuild: make configure.make] [ocamlfind: patch]
Processing 233/352: [zarith.1.14: extract] [num: make opam-modern] [ocamlbuild: make configure.make] [ocamlfind: patch]
Processing 234/352: [zarith.1.14: extract] [num: make opam-modern] [ocamlbuild: make configure.make] [ocamlfind: patch]
Processing 235/352: [zarith.1.14: extract] [num: make opam-modern] [ocamlbuild: make configure.make] [ocamlfind: patch]
Processing 236/352: [zarith.1.14: extract] [num: make opam-modern] [ocamlbuild: make configure.make] [ocamlfind: patch]
Processing 237/352: [zarith.1.14: extract] [num: make opam-modern] [ocamlbuild: make configure.make] [ocamlfind: patch]
Processing 238/352: [zarith.1.14: extract] [num: make opam-modern] [ocamlbuild: make configure.make] [ocamlfind: patch]
Processing 239/352: [zarith.1.14: extract] [num: make opam-modern] [ocamlbuild: make configure.make] [ocamlfind: patch]
Processing 240/352: [zarith.1.14: extract] [num: make opam-modern] [ocamlbuild: make configure.make] [ocamlfind: patch]
Processing 241/352: [zarith.1.14: extract] [num: make opam-modern] [ocamlbuild: make configure.make] [ocamlfind: patch]
Processing 242/352: [zarith.1.14: extract] [num: make opam-modern] [ocamlbuild: make configure.make] [ocamlfind: patch]
Processing 243/352: [zarith.1.14: extract] [num: make opam-modern] [ocamlbuild: make configure.make] [ocamlfind: patch]
Processing 244/352: [zarith.1.14: extract] [num: make opam-modern] [ocamlbuild: make configure.make] [ocamlfind: patch]
Processing 245/352: [zarith.1.14: extract] [num: make opam-modern] [ocamlbuild: make configure.make] [ocamlfind: patch]
Processing 246/352: [zarith.1.14: extract] [num: make opam-modern] [ocamlbuild: make configure.make] [ocamlfind: patch]
Processing 247/352: [zarith.1.14: extract] [num: make opam-modern] [ocamlbuild: make configure.make] [ocamlfind: patch]
Processing 248/352: [zarith.1.14: extract] [num: make opam-modern] [ocamlbuild: make configure.make] [ocamlfind: patch]
Processing 249/352: [zarith.1.14: extract] [num: make opam-modern] [ocamlbuild: make configure.make] [ocamlfind: patch]
Processing 250/352: [zarith.1.14: extract] [num: make opam-modern] [ocamlbuild: make configure.make] [ocamlfind: patch]
Processing 251/352: [zarith.1.14: extract] [num: make opam-modern] [ocamlbuild: make configure.make] [ocamlfind: patch]
Processing 252/352: [zarith.1.14: extract] [num: make opam-modern] [ocamlbuild: make configure.make] [ocamlfind: patch]
Processing 253/352: [zarith.1.14: extract] [num: make opam-modern] [ocamlbuild: make configure.make] [ocamlfind: patch]
Processing 254/352: [zarith.1.14: extract] [num: make opam-modern] [ocamlbuild: make configure.make] [ocamlfind: patch]
Processing 255/352: [zarith.1.14: extract] [num: make opam-modern] [ocamlbuild: make configure.make] [ocamlfind: patch]
Processing 256/352: [zarith.1.14: extract] [num: make opam-modern] [ocamlbuild: make configure.make] [ocamlfind: patch]
Processing 257/352: [zarith.1.14: extract] [num: make opam-modern] [ocamlbuild: make configure.make] [ocamlfind: patch]
Processing 258/352: [zarith.1.14: extract] [num: make opam-modern] [ocamlbuild: make configure.make] [ocamlfind: patch]
Processing 259/352: [zarith.1.14: extract] [num: make opam-modern] [ocamlbuild: make configure.make] [ocamlfind: patch]
Processing 260/352: [zarith.1.14: extract] [num: make opam-modern] [ocamlbuild: make configure.make] [ocamlfind: patch]
Processing 261/352: [zarith.1.14: extract] [num: make opam-modern] [ocamlbuild: make configure.make] [ocamlfind: patch]
Processing 262/352: [zarith.1.14: extract] [num: make opam-modern] [ocamlbuild: make configure.make] [ocamlfind: patch]
Processing 263/352: [zarith.1.14: extract] [num: make opam-modern] [ocamlbuild: make configure.make] [ocamlfind: patch]
Processing 264/352: [zarith.1.14: extract] [num: make opam-modern] [ocamlbuild: make configure.make] [ocamlfind: patch]
Processing 265/352: [zarith.1.14: extract] [num: make opam-modern] [ocamlbuild: make configure.make] [ocamlfind: patch]
Processing 266/352: [zarith.1.14: extract] [num: make opam-modern] [ocamlbuild: make configure.make] [ocamlfind: patch]
Processing 267/352: [zarith.1.14: extract] [num: make opam-modern] [ocamlbuild: make configure.make] [ocamlfind: patch]
Processing 268/352: [zarith.1.14: extract] [num: make opam-modern] [ocamlbuild: make configure.make] [ocamlfind: patch]
Processing 269/352: [zarith.1.14: extract] [num: make opam-modern] [ocamlbuild: make configure.make] [ocamlfind: patch]
Processing 270/352: [zarith.1.14: extract] [num: make opam-modern] [ocamlbuild: make configure.make] [ocamlfind: patch]
Processing 271/352: [zarith.1.14: extract] [num: make opam-modern] [ocamlbuild: make configure.make] [ocamlfind: patch]
Processing 272/352: [zarith.1.14: extract] [num: make opam-modern] [ocamlbuild: make configure.make] [ocamlfind: patch]
Processing 273/352: [zarith.1.14: extract] [num: make opam-modern] [ocamlbuild: make configure.make] [ocamlfind: patch]
Processing 274/352: [zarith.1.14: extract] [num: make opam-modern] [ocamlbuild: make configure.make] [ocamlfind: patch]
Processing 275/352: [zarith.1.14: extract] [num: make opam-modern] [ocamlbuild: make configure.make] [ocamlfind: patch]
Processing 276/352: [zarith.1.14: extract] [num: make opam-modern] [ocamlbuild: make configure.make] [ocamlfind: patch]
Processing 277/352: [zarith.1.14: extract] [num: make opam-modern] [ocamlbuild: make configure.make] [ocamlfind: patch]
Processing 278/352: [zarith.1.14: extract] [num: make opam-modern] [ocamlbuild: make configure.make] [ocamlfind: patch]
Processing 279/352: [zarith.1.14: extract] [num: make opam-modern] [ocamlbuild: make configure.make] [ocamlfind: patch]
Processing 280/352: [zarith.1.14: extract] [num: make opam-modern] [ocamlbuild: make configure.make] [ocamlfind: patch]
Processing 281/352: [zarith.1.14: extract] [num: make opam-modern] [ocamlbuild: make configure.make] [ocamlfind: patch]
Processing 282/352: [zarith.1.14: extract] [num: make opam-modern] [ocamlbuild: make configure.make] [ocamlfind: patch]
Processing 283/352: [zarith.1.14: extract] [num: make opam-modern] [ocamlbuild: make configure.make] [ocamlfind: patch]
+ C:\cygwin64\bin\make.exe "PROFILE=release" "opam-modern" (CWD=C:\Users\opam\AppData\Local\opam\5.3\.opam-switch\build\num.1.5-1)
- /usr/bin/make -C src all
- make[1]: Entering directory '/cygdrive/c/Users/opam/AppData/Local/opam/5.3/.opam-switch/build/num.1.5-1/src'
- ocamlc -ccopt -DBNG_ARCH_amd64 -c bng.c
- ocamlc -ccopt -DBNG_ARCH_amd64 -c nat_stubs.c
- ocamlmklib -oc nums bng.o nat_stubs.o
- ocamlc -w +a-4-9-41-42-44-45-48  -bin-annot -g -safe-string -strict-sequence -strict-formats -I +compiler-libs -c int_misc.mli
- ocamlc -w +a-4-9-41-42-44-45-48  -bin-annot -g -safe-string -strict-sequence -strict-formats -I +compiler-libs -c int_misc.ml
- ocamlc -w +a-4-9-41-42-44-45-48  -bin-annot -g -safe-string -strict-sequence -strict-formats -I +compiler-libs -c nat.mli
- ocamlc -w +a-4-9-41-42-44-45-48  -bin-annot -g -safe-string -strict-sequence -strict-formats -I +compiler-libs -c nat.ml
- ocamlc -w +a-4-9-41-42-44-45-48  -bin-annot -g -safe-string -strict-sequence -strict-formats -I +compiler-libs -c big_int.mli
- ocamlc -w +a-4-9-41-42-44-45-48  -bin-annot -g -safe-string -strict-sequence -strict-formats -I +compiler-libs -c big_int.ml
- ocamlc -w +a-4-9-41-42-44-45-48  -bin-annot -g -safe-string -strict-sequence -strict-formats -I +compiler-libs -c arith_flags.mli
- ocamlc -w +a-4-9-41-42-44-45-48  -bin-annot -g -safe-string -strict-sequence -strict-formats -I +compiler-libs -c arith_flags.ml
- ocamlc -w +a-4-9-41-42-44-45-48  -bin-annot -g -safe-string -strict-sequence -strict-formats -I +compiler-libs -c ratio.mli
- ocamlc -w +a-4-9-41-42-44-45-48  -bin-annot -g -safe-string -strict-sequence -strict-formats -I +compiler-libs -c ratio.ml
- ocamlc -w +a-4-9-41-42-44-45-48  -bin-annot -g -safe-string -strict-sequence -strict-formats -I +compiler-libs -c num.mli
- ocamlc -w +a-4-9-41-42-44-45-48  -bin-annot -g -safe-string -strict-sequence -strict-formats -I +compiler-libs -c num.ml
- ocamlc -w +a-4-9-41-42-44-45-48  -bin-annot -g -safe-string -strict-sequence -strict-formats -I +compiler-libs -c arith_status.mli
- ocamlc -w +a-4-9-41-42-44-45-48  -bin-annot -g -safe-string -strict-sequence -strict-formats -I +compiler-libs -c arith_status.ml
- ocamlmklib -o nums -oc nums -linkall int_misc.cmo nat.cmo big_int.cmo arith_flags.cmo ratio.cmo num.cmo arith_status.cmo
- cp ../toplevel/num_top_printers.mli ../toplevel/num_top.mli ../toplevel/num_top_printers.ml ../toplevel/num_top.ml .
- ocamlc -w +a-4-9-41-42-44-45-48  -bin-annot -g -safe-string -strict-sequence -strict-formats -I +compiler-libs -c num_top_printers.mli
- ocamlc -w +a-4-9-41-42-44-45-48  -bin-annot -g -safe-string -strict-sequence -strict-formats -I +compiler-libs -c num_top_printers.ml
- ocamlc -w +a-4-9-41-42-44-45-48  -bin-annot -g -safe-string -strict-sequence -strict-formats -I +compiler-libs -c num_top.mli
- ocamlc -w +a-4-9-41-42-44-45-48  -bin-annot -g -safe-string -strict-sequence -strict-formats -I +compiler-libs -c num_top.ml
- ocamlc -w +a-4-9-41-42-44-45-48  -bin-annot -g -safe-string -strict-sequence -strict-formats -I +compiler-libs -a -o num_top.cma num_top_printers.cmo num_top.cmo
- echo 'version = "1.6~dev"' > META.top
- cat META.num-top.in >> META.top
- ocamlopt -w +a-4-9-41-42-44-45-48  -bin-annot -g -safe-string -strict-sequence -strict-formats -I +compiler-libs -c int_misc.ml
- ocamlopt -w +a-4-9-41-42-44-45-48  -bin-annot -g -safe-string -strict-sequence -strict-formats -I +compiler-libs -c nat.ml
- ocamlopt -w +a-4-9-41-42-44-45-48  -bin-annot -g -safe-string -strict-sequence -strict-formats -I +compiler-libs -c big_int.ml
- ocamlopt -w +a-4-9-41-42-44-45-48  -bin-annot -g -safe-string -strict-sequence -strict-formats -I +compiler-libs -c arith_flags.ml
- ocamlopt -w +a-4-9-41-42-44-45-48  -bin-annot -g -safe-string -strict-sequence -strict-formats -I +compiler-libs -c ratio.ml
- ocamlopt -w +a-4-9-41-42-44-45-48  -bin-annot -g -safe-string -strict-sequence -strict-formats -I +compiler-libs -c num.ml
- ocamlopt -w +a-4-9-41-42-44-45-48  -bin-annot -g -safe-string -strict-sequence -strict-formats -I +compiler-libs -c arith_status.ml
- ocamlmklib -o nums -oc nums -linkall int_misc.cmx nat.cmx big_int.cmx arith_flags.cmx ratio.cmx num.cmx arith_status.cmx
- ocamlopt -w +a-4-9-41-42-44-45-48  -bin-annot -g -safe-string -strict-sequence -strict-formats -I +compiler-libs -I . -shared -o nums.cmxs nums.cmxa
- make[1]: Leaving directory '/cygdrive/c/Users/opam/AppData/Local/opam/5.3/.opam-switch/build/num.1.5-1/src'
- cp src/num-modern.install num.install
-> compiled  num.1.5-1
Processing 283/352: [zarith.1.14: extract] [ocamlbuild: make configure.make] [ocamlfind: patch]
-> installed num.1.5-1
Processing 284/352: [zarith.1.14: extract] [ocamlbuild: make configure.make] [ocamlfind: patch]
Processing 285/352: [zarith.1.14: extract] [ocamlbuild: make configure.make] [ocamlfind: patch]
Processing 286/352: [zarith.1.14: extract] [ocamlbuild: make configure.make] [ocamlfind: patch]
Processing 287/352: [zarith.1.14: extract] [ocamlbuild: make configure.make] [ocamlfind: patch]
Processing 288/352: [zarith.1.14: extract] [ocamlbuild: make configure.make] [ocamlfind: patch]
Processing 289/352: [zarith.1.14: extract] [ocamlbuild: make configure.make] [ocamlfind: patch]
Processing 290/352: [zarith.1.14: extract] [ocamlbuild: make configure.make] [ocamlfind: patch]
Processing 291/352: [zarith.1.14: extract] [ocamlbuild: make configure.make] [ocamlfind: patch]
Processing 292/352: [zarith.1.14: extract] [ocamlbuild: make configure.make] [ocamlfind: patch]
Processing 293/352: [zarith.1.14: extract] [ocamlbuild: make configure.make] [ocamlfind: patch]
Processing 294/352: [zarith.1.14: extract] [ocamlbuild: make configure.make] [ocamlfind: patch]
Processing 295/352: [zarith.1.14: extract] [ocamlbuild: make configure.make] [ocamlfind: patch]
Processing 296/352: [zarith.1.14: extract] [ocamlbuild: make configure.make] [ocamlfind: patch]
Processing 297/352: [zarith.1.14: extract] [ocamlbuild: make configure.make] [ocamlfind: patch]
Processing 298/352: [zarith.1.14: extract] [ocamlbuild: make configure.make] [ocamlfind: patch]
Processing 299/352: [zarith.1.14: extract] [ocamlbuild: make configure.make] [ocamlfind: patch]
Processing 300/352: [zarith.1.14: extract] [ocamlbuild: make configure.make] [ocamlfind: patch]
Processing 301/352: [zarith.1.14: extract] [ocamlbuild: make configure.make] [ocamlfind: patch]
Processing 302/352: [zarith.1.14: extract] [ocamlbuild: make configure.make] [ocamlfind: patch]
Processing 303/352: [zarith.1.14: extract] [ocamlbuild: make configure.make] [ocamlfind: patch]
Processing 304/352: [zarith.1.14: extract] [ocamlbuild: make configure.make] [ocamlfind: patch]
Processing 305/352: [zarith.1.14: extract] [ocamlbuild: make configure.make] [ocamlfind: patch]
Processing 306/352: [zarith.1.14: extract] [ocamlbuild: make configure.make] [ocamlfind: patch]
Processing 307/352: [zarith.1.14: extract] [ocamlbuild: make configure.make] [ocamlfind: patch]
Processing 308/352: [zarith.1.14: extract] [ocamlbuild: make configure.make] [ocamlfind: patch]
Processing 309/352: [zarith.1.14: extract] [ocamlbuild: make configure.make] [ocamlfind: patch]
Processing 310/352: [zarith.1.14: extract] [ocamlbuild: make configure.make] [ocamlfind: patch]
Processing 311/352: [zarith.1.14: extract] [ocamlbuild: make configure.make] [ocamlfind: patch]
Processing 312/352: [zarith.1.14: extract] [ocamlbuild: make configure.make] [ocamlfind: patch]
Processing 313/352: [zarith.1.14: extract] [ocamlbuild: make configure.make] [ocamlfind: patch]
Processing 314/352: [zarith.1.14: extract] [ocamlbuild: make configure.make] [ocamlfind: patch]
Processing 315/352: [zarith.1.14: extract] [ocamlbuild: make configure.make] [ocamlfind: patch]
Processing 316/352: [zarith.1.14: extract] [ocamlbuild: make configure.make] [ocamlfind: patch]
Processing 317/352: [zarith.1.14: extract] [ocamlbuild: make configure.make] [ocamlfind: patch]
Processing 318/352: [zarith.1.14: extract] [ocamlbuild: make configure.make] [ocamlfind: patch]
Processing 319/352: [zarith.1.14: extract] [ocamlbuild: make configure.make] [ocamlfind: patch]
Processing 320/352: [zarith.1.14: extract] [ocamlbuild: make configure.make] [ocamlfind: patch]
Processing 321/352: [zarith.1.14: extract] [ocamlbuild: make configure.make] [ocamlfind: patch]
Processing 322/352: [zarith.1.14: extract] [ocamlbuild: make configure.make] [ocamlfind: patch]
-> retrieved zarith.1.14  (cached)
Processing 322/352: [ocamlbuild: make configure.make] [ocamlfind: patch]
+ C:\cygwin64\bin\make.exe "-f" "configure.make" "all" "OCAMLBUILD_PREFIX=C:\\Users\\opam\\AppData\\Local\\opam\\5.3" "OCAMLBUILD_BINDIR=C:\\Users\\opam\\AppData\\Local\\opam\\5.3\\bin" "OCAMLBUILD_LIBDIR=C:\\Users\\opam\\AppData\\Local\\opam\\5.3\\lib" "OCAMLBUILD_MANDIR=C:\\Users\\opam\\AppData\\Local\\opam\\5.3\\man" "OCAML_NATIVE=true" "OCAML_NATIVE_TOOLS=true" (CWD=C:\Users\opam\AppData\Local\opam\5.3\.opam-switch\build\ocamlbuild.0.15.0)
- (echo "# This file was generated from configure.make"; \
- echo ;\
- echo "OCAML_PREFIX="; \
- echo "OCAML_BINDIR=C:/Users/opam/AppData/Local/opam/5.3/bin"; \
- echo "OCAML_LIBDIR=C:/Users/opam/AppData/Local/opam/5.3/lib/ocaml"; \
- echo "OCAML_MANDIR=C:/Users/opam/AppData/Local/opam/5.3/man"; \
- echo ;\
- echo "EXT_OBJ=.o"; \
- echo "EXT_ASM=.s"; \
- echo "EXT_LIB=.a"; \
- echo "EXT_DLL=.dll"; \
- echo "EXE=.exe"; \
- echo ;\
- echo "OCAML_NATIVE=true"; \
- echo "OCAML_NATIVE_TOOLS=true"; \
- echo "NATDYNLINK=true"; \
- echo "SUPPORT_SHARED_LIBRARIES=true"; \
- echo ;\
- echo "PREFIX=C:\Users\opam\AppData\Local\opam\5.3"; \
- echo "BINDIR=C:\Users\opam\AppData\Local\opam\5.3\bin"; \
- echo "LIBDIR=C:\Users\opam\AppData\Local\opam\5.3\lib"; \
- echo "MANDIR=C:\Users\opam\AppData\Local\opam\5.3\man"; \
- ) > Makefile.config
- (echo "(* This file was generated from ../configure.make *)"; \
- echo ;\
- echo 'let bindir = {|C:\Users\opam\AppData\Local\opam\5.3\bin|}'; \
- echo 'let libdir = {|C:\Users\opam\AppData\Local\opam\5.3\lib|}'; \
- echo 'let ocaml_libdir = {|C:/Users/opam/AppData/Local/opam/5.3/lib/ocaml|}'; \
- echo 'let libdir_abs = {|C:/Users/opam/AppData/Local/opam/5.3/lib|}'; \
- echo 'let ocaml_native = true'; \
- echo 'let ocaml_native_tools = true'; \
- echo 'let supports_shared_libraries = true';\
- echo 'let a = "a"'; \
- echo 'let o = "o"'; \
- echo 'let so = "dll"'; \
- echo 'let ext_dll = ".dll"'; \
- echo 'let exe = ".exe"'; \
- echo 'let version = "0.15.0"'; \
- ) > src/ocamlbuild_config.ml
Processing 322/352: [ocamlbuild: make check-if-preinstalled] [ocamlfind: patch]
Processing 322/352: [ocamlbuild: make check-if-preinstalled] [ocamlfind: ./configure C:\Users\opam\AppData\Local\opam\5.3\bin]
+ C:\Users\opam\AppData\Local\opam\5.3\.opam-switch\build\ocamlfind.1.9.5\./configure "-bindir" "C:\\Users\\opam\\AppData\\Local\\opam\\5.3\\bin" "-sitelib" "C:\\Users\\opam\\AppData\\Local\\opam\\5.3\\lib" "-mandir" "C:\\Users\\opam\\AppData\\Local\\opam\\5.3\\man" "-config" "C:\\Users\\opam\\AppData\\Local\\opam\\5.3\\lib/findlib.conf" "-no-custom" "-no-camlp4" (CWD=C:\Users\opam\AppData\Local\opam\5.3\.opam-switch\build\ocamlfind.1.9.5)
- Welcome to findlib version 1.9.5
- Configuring core...
- Cygwin build environment found; using .exe as suffix for binaries
- Checking for #remove_directory...
- Testing threading model...
- systhread_supported: true
- Testing DLLs...
- Testing whether ppxopt can be supported...
- Checking for ocamlc -opaque...
- Querying installation: META list not found
- make install will double-check installed META files
- Configuring libraries...
- unix: found (in +unix)
- dynlink: found (in +dynlink)
- bigarray: not present (possible since 4.08)
- compiler-libs: found
- dbm: not present (normal since 4.00)
- graphics: not present (normal since 4.09)
- num: not present (normal since 4.06)
- ocamlbuild: not present (normal since 4.03)
- ocamldoc: found (in +ocamldoc)
- raw_spacetime: not present (normal since 4.12)
- threads: found (in +threads)
- runtime_events: found (in +runtime_events)
- str: found (in +str)
- labltk: not present (normal since 4.02)
- native dynlink: found
- camlp4: disabled
- bytes: found, installing fake library
- Configuration for stdlib written to site-lib-src/stdlib/META
- Configuration for unix written to site-lib-src/unix/META
- Configuration for dynlink written to site-lib-src/dynlink/META
- Configuration for compiler-libs written to site-lib-src/compiler-libs/META
- Configuration for ocamldoc written to site-lib-src/ocamldoc/META
- Configuration for threads written to site-lib-src/threads/META
- Configuration for runtime_events written to site-lib-src/runtime_events/META
- Configuration for str written to site-lib-src/str/META
- Configuration for bytes written to site-lib-src/bytes/META
- Detecting compiler arguments: (extractor built) ok
- 
- About the OCAML core installation:
-     Standard library:      /cygdrive/c/Users/opam/AppData/Local/opam/5.3/lib/ocaml
-     Binaries:              /cygdrive/c/Users/opam/AppData/Local/opam/5.3/bin
-     Manual pages:          /usr/local/man
-     Multi-threading type:  posix
- The directory of site-specific packages will be
-     site-lib:              C:\Users\opam\AppData\Local\opam\5.3\lib
- The configuration file is written to:
-     findlib config file:   C:\Users\opam\AppData\Local\opam\5.3\lib/findlib.conf
- Software will be installed:
-     Libraries:             in <site-lib>/findlib
-     Binaries:              C:\Users\opam\AppData\Local\opam\5.3\bin
-     Manual pages:          C:\Users\opam\AppData\Local\opam\5.3\man
-     topfind script:        /cygdrive/c/Users/opam/AppData/Local/opam/5.3/lib/ocaml
- Topfind ppxopt support:    yes
- Toolbox:                   no
- Link custom runtime:       no
- Need bytes compatibility:  no
- 
- Configuration has been written to Makefile.config
- 
- You can now do 'make all', and optionally 'make opt', to build ocamlfind.
Processing 322/352: [ocamlbuild: make check-if-preinstalled] [ocamlfind: make all]
+ C:\cygwin64\bin\make.exe "all" (CWD=C:\Users\opam\AppData\Local\opam\5.3\.opam-switch\build\ocamlfind.1.9.5)
- for p in findlib; do ( cd src/$p; /usr/bin/make all ) || exit; done
- make[1]: Entering directory '/cygdrive/c/Users/opam/AppData/Local/opam/5.3/.opam-switch/build/ocamlfind.1.9.5/src/findlib'
- ocamllex fl_meta.mll
- 22 states, 392 transitions, table size 1700 bytes
- USE_CYGPATH="1"; \
- export USE_CYGPATH; \
- cat findlib_config.mlp | \
-          ../../tools/patch '@CONFIGFILE@' 'C:\Users\opam\AppData\Local\opam\5.3\lib/findlib.conf' | \
-          ../../tools/patch '@STDLIB@' '/cygdrive/c/Users/opam/AppData/Local/opam/5.3/lib/ocaml' | \
- 	sed -e 's;@AUTOLINK@;true;g' \
- 	    -e 's;@SYSTEM@;mingw64;g' \
- 	     >findlib_config.ml
- if [ "true" = "true" ]; then                 \
- 	cp topfind.ml.in topfind.ml;                             \
- else                                                             \
- 	sed -e '/PPXOPT_BEGIN/,/PPXOPT_END/ d' topfind.ml.in     \
- 		> topfind.ml ;                                   \
- fi
- ocamldep *.ml *.mli >depend
- ocamlc -I +compiler-libs    -I +unix -I +dynlink -g -c findlib_config.ml
- ocamlc -I +compiler-libs    -I +unix -I +dynlink -g -c fl_split.ml
- ocamlc -I +compiler-libs    -I +unix -I +dynlink -g -c fl_metatoken.ml
- ocamlc -I +compiler-libs    -I +unix -I +dynlink -g -c fl_meta.ml
- ocamlc -I +compiler-libs    -I +unix -I +dynlink -c fl_metascanner.mli
- ocamlc -I +compiler-libs    -I +unix -I +dynlink -g -c fl_metascanner.ml
- ocamlc -I +compiler-libs    -I +unix -I +dynlink -c fl_topo.mli
- ocamlc -I +compiler-libs    -I +unix -I +dynlink -g -c fl_topo.ml
- ocamlc -I +compiler-libs    -I +unix -I +dynlink -c fl_package_base.mli
- ocamlc -I +compiler-libs    -I +unix -I +dynlink -g -c fl_package_base.ml
- File "fl_package_base.ml", line 304, characters 22-40:
- 304 | 	 let pkg_ancestors = query_requirements predlist pkg in
-       	                     ^^^^^^^^^^^^^^^^^^
- Warning 6 [labels-omitted]: label preds was omitted in the application of this function.
- 
- File "fl_package_base.ml", line 350, characters 18-36:
- 350 |   let ancestors = query_requirements predlist package_name in
-                         ^^^^^^^^^^^^^^^^^^
- Warning 6 [labels-omitted]: label preds was omitted in the application of this function.
- 
- File "fl_package_base.ml", line 375, characters 23-41:
- 375 | 	  let pkg_ancestors = query_requirements predlist pkg in
-       	                      ^^^^^^^^^^^^^^^^^^
- Warning 6 [labels-omitted]: label preds was omitted in the application of this function.
- 
- File "fl_package_base.ml", line 510, characters 16-35:
- 510 | 	     ( let c = package_definitions search_path pkg.package_name in
-       	               ^^^^^^^^^^^^^^^^^^^
- Warning 6 [labels-omitted]: label search_path was omitted in the application of this function.
- ocamlc -I +compiler-libs    -I +unix -I +dynlink -c findlib.mli
- ocamlc -I +compiler-libs    -I +unix -I +dynlink -g -c findlib.ml
- File "findlib.ml", line 390, characters 2-26:
- 390 |   Fl_package_base.requires predlist pkg
-         ^^^^^^^^^^^^^^^^^^^^^^^^
- Warning 6 [labels-omitted]: label preds was omitted in the application of this function.
- 
- File "findlib.ml", line 396, characters 2-33:
- 396 |   Fl_package_base.requires_deeply predlist pkglist
-         ^^^^^^^^^^^^^^^^^^^^^^^^^^^^^^^
- Warning 6 [labels-omitted]: label preds was omitted in the application of this function.
- ocamlc -I +compiler-libs    -I +unix -I +dynlink -g -c fl_args.ml
- ocamlc -I +compiler-libs    -I +unix -I +dynlink -g -c fl_lint.ml
- ocamlc -I +compiler-libs -a -o findlib.cma findlib_config.cmo fl_split.cmo fl_metatoken.cmo fl_meta.cmo fl_metascanner.cmo fl_topo.cmo fl_package_base.cmo findlib.cmo fl_args.cmo fl_lint.cmo
- ocamlc -I +compiler-libs    -I +unix -I +dynlink -g -c ocaml_args.ml
- ocamlc -I +compiler-libs    -I +unix -I +dynlink -g -c frontend.ml
- File "frontend.ml", line 859, characters 10-39:
- 859 |           Fl_package_base.package_users predicates1 packages1
-                 ^^^^^^^^^^^^^^^^^^^^^^^^^^^^^
- Warning 6 [labels-omitted]: label preds was omitted in the application of this function.
- ocamlc -I +compiler-libs  -o ocamlfind.exe -g findlib.cma unix.cma \
-            -I +unix -I +dynlink ocaml_args.cmo frontend.cmo
- ocamlc -I +compiler-libs    -I +unix -I +dynlink -c topfind.mli
- ocamlc -I +compiler-libs    -I +unix -I +dynlink -g -c topfind.ml
- File "topfind.ml", line 126, characters 40-63:
- 126 |                      match Hashtbl.find Toploop.directive_table "ppx" with
-                                               ^^^^^^^^^^^^^^^^^^^^^^^
- Alert deprecated: Toploop.directive_table
- 
- File "topfind.ml", line 256, characters 4-27:
- 256 |     Toploop.directive_table
-           ^^^^^^^^^^^^^^^^^^^^^^^
- Alert deprecated: Toploop.directive_table
- 
- File "topfind.ml", line 266, characters 4-27:
- 266 |     Toploop.directive_table
-           ^^^^^^^^^^^^^^^^^^^^^^^
- Alert deprecated: Toploop.directive_table
- 
- File "topfind.ml", line 278, characters 4-27:
- 278 |     Toploop.directive_table
-           ^^^^^^^^^^^^^^^^^^^^^^^
- Alert deprecated: Toploop.directive_table
- 
- File "topfind.ml", line 291, characters 4-27:
- 291 |     Toploop.directive_table
-           ^^^^^^^^^^^^^^^^^^^^^^^
- Alert deprecated: Toploop.directive_table
- 
- File "topfind.ml", line 305, characters 4-27:
- 305 |     Toploop.directive_table
-           ^^^^^^^^^^^^^^^^^^^^^^^
- Alert deprecated: Toploop.directive_table
- 
- File "topfind.ml", line 317, characters 4-27:
- 317 |     Toploop.directive_table
-           ^^^^^^^^^^^^^^^^^^^^^^^
- Alert deprecated: Toploop.directive_table
- ocamlc -I +compiler-libs -a -o findlib_top.cma topfind.cmo
- USE_CYGPATH="1"; \
- export USE_CYGPATH; \
- cat topfind_rd1.p | \
-          ../../tools/patch '@SITELIB@' 'C:\Users\opam\AppData\Local\opam\5.3\lib' \
-     	    >topfind
- ocamlc -I +compiler-libs    -I +unix -I +dynlink -c fl_dynload.mli
- ocamlc -I +compiler-libs    -I +unix -I +dynlink -g -c fl_dynload.ml
- ocamlc -I +compiler-libs -a -o findlib_dynload.cma fl_dynload.cmo
- make[1]: Leaving directory '/cygdrive/c/Users/opam/AppData/Local/opam/5.3/.opam-switch/build/ocamlfind.1.9.5/src/findlib'
- /usr/bin/make all-config
- make[1]: Entering directory '/cygdrive/c/Users/opam/AppData/Local/opam/5.3/.opam-switch/build/ocamlfind.1.9.5'
- USE_CYGPATH="1"; \
- export USE_CYGPATH; \
- cat findlib.conf.in | \
-      tools/patch '@SITELIB@' 'C:\Users\opam\AppData\Local\opam\5.3\lib' >findlib.conf
- if ./tools/cmd_from_same_dir ocamlc; then \
- 	echo 'ocamlc="ocamlc.opt"' >>findlib.conf; \
- fi
- if ./tools/cmd_from_same_dir ocamlopt; then \
- 	echo 'ocamlopt="ocamlopt.opt"' >>findlib.conf; \
- fi
- if ./tools/cmd_from_same_dir ocamldep; then \
- 	echo 'ocamldep="ocamldep.opt"' >>findlib.conf; \
- fi
- if ./tools/cmd_from_same_dir ocamldoc; then \
- 	echo 'ocamldoc="ocamldoc.opt"' >>findlib.conf; \
- fi
- make[1]: Leaving directory '/cygdrive/c/Users/opam/AppData/Local/opam/5.3/.opam-switch/build/ocamlfind.1.9.5'
Processing 322/352: [ocamlbuild: make check-if-preinstalled] [ocamlfind: make opt]
+ C:\cygwin64\bin\make.exe "opt" (CWD=C:\Users\opam\AppData\Local\opam\5.3\.opam-switch\build\ocamlfind.1.9.5)
- for p in findlib; do ( cd src/$p; /usr/bin/make opt ) || exit; done
- make[1]: Entering directory '/cygdrive/c/Users/opam/AppData/Local/opam/5.3/.opam-switch/build/ocamlfind.1.9.5/src/findlib'
- ocamlopt -I +compiler-libs -g   -I +unix -I +dynlink -c findlib_config.ml
- ocamlopt -I +compiler-libs -g   -I +unix -I +dynlink -c fl_split.ml
- ocamlopt -I +compiler-libs -g   -I +unix -I +dynlink -c fl_metatoken.ml
- ocamlopt -I +compiler-libs -g   -I +unix -I +dynlink -c fl_meta.ml
- ocamlopt -I +compiler-libs -g   -I +unix -I +dynlink -c fl_metascanner.ml
- ocamlopt -I +compiler-libs -g   -I +unix -I +dynlink -c fl_topo.ml
- ocamlopt -I +compiler-libs -g   -I +unix -I +dynlink -c fl_package_base.ml
- File "fl_package_base.ml", line 304, characters 22-40:
- 304 | 	 let pkg_ancestors = query_requirements predlist pkg in
-       	                     ^^^^^^^^^^^^^^^^^^
- Warning 6 [labels-omitted]: label preds was omitted in the application of this function.
- 
- File "fl_package_base.ml", line 350, characters 18-36:
- 350 |   let ancestors = query_requirements predlist package_name in
-                         ^^^^^^^^^^^^^^^^^^
- Warning 6 [labels-omitted]: label preds was omitted in the application of this function.
- 
- File "fl_package_base.ml", line 375, characters 23-41:
- 375 | 	  let pkg_ancestors = query_requirements predlist pkg in
-       	                      ^^^^^^^^^^^^^^^^^^
- Warning 6 [labels-omitted]: label preds was omitted in the application of this function.
- 
- File "fl_package_base.ml", line 510, characters 16-35:
- 510 | 	     ( let c = package_definitions search_path pkg.package_name in
-       	               ^^^^^^^^^^^^^^^^^^^
- Warning 6 [labels-omitted]: label search_path was omitted in the application of this function.
- ocamlopt -I +compiler-libs -g   -I +unix -I +dynlink -c findlib.ml
- File "findlib.ml", line 390, characters 2-26:
- 390 |   Fl_package_base.requires predlist pkg
-         ^^^^^^^^^^^^^^^^^^^^^^^^
- Warning 6 [labels-omitted]: label preds was omitted in the application of this function.
- 
- File "findlib.ml", line 396, characters 2-33:
- 396 |   Fl_package_base.requires_deeply predlist pkglist
-         ^^^^^^^^^^^^^^^^^^^^^^^^^^^^^^^
- Warning 6 [labels-omitted]: label preds was omitted in the application of this function.
- ocamlopt -I +compiler-libs -g   -I +unix -I +dynlink -c fl_args.ml
- ocamlopt -I +compiler-libs -g   -I +unix -I +dynlink -c fl_lint.ml
- ocamlopt -I +compiler-libs -g -a -o findlib.cmxa findlib_config.cmx fl_split.cmx fl_metatoken.cmx fl_meta.cmx fl_metascanner.cmx fl_topo.cmx fl_package_base.cmx findlib.cmx fl_args.cmx fl_lint.cmx
- if [ 1 -gt 0 ]; then \
-     ocamlopt -I +compiler-libs -g -shared -o findlib.cmxs findlib_config.cmx fl_split.cmx fl_metatoken.cmx fl_meta.cmx fl_metascanner.cmx fl_topo.cmx fl_package_base.cmx findlib.cmx fl_args.cmx fl_lint.cmx; \
- fi
- ocamlopt -I +compiler-libs -g   -I +unix -I +dynlink -c ocaml_args.ml
- ocamlopt -I +compiler-libs -g   -I +unix -I +dynlink -c frontend.ml
- File "frontend.ml", line 859, characters 10-39:
- 859 |           Fl_package_base.package_users predicates1 packages1
-                 ^^^^^^^^^^^^^^^^^^^^^^^^^^^^^
- Warning 6 [labels-omitted]: label preds was omitted in the application of this function.
- ocamlopt -I +compiler-libs -g -o ocamlfind_opt.exe findlib.cmxa unix.cmxa \
- 	   -I +unix -I +dynlink ocaml_args.cmx frontend.cmx
- ocamlopt -I +compiler-libs -g   -I +unix -I +dynlink -c topfind.ml
- File "topfind.ml", line 126, characters 40-63:
- 126 |                      match Hashtbl.find Toploop.directive_table "ppx" with
-                                               ^^^^^^^^^^^^^^^^^^^^^^^
- Alert deprecated: Toploop.directive_table
- 
- File "topfind.ml", line 256, characters 4-27:
- 256 |     Toploop.directive_table
-           ^^^^^^^^^^^^^^^^^^^^^^^
- Alert deprecated: Toploop.directive_table
- 
- File "topfind.ml", line 266, characters 4-27:
- 266 |     Toploop.directive_table
-           ^^^^^^^^^^^^^^^^^^^^^^^
- Alert deprecated: Toploop.directive_table
- 
- File "topfind.ml", line 278, characters 4-27:
- 278 |     Toploop.directive_table
-           ^^^^^^^^^^^^^^^^^^^^^^^
- Alert deprecated: Toploop.directive_table
- 
- File "topfind.ml", line 291, characters 4-27:
- 291 |     Toploop.directive_table
-           ^^^^^^^^^^^^^^^^^^^^^^^
- Alert deprecated: Toploop.directive_table
- 
- File "topfind.ml", line 305, characters 4-27:
- 305 |     Toploop.directive_table
-           ^^^^^^^^^^^^^^^^^^^^^^^
- Alert deprecated: Toploop.directive_table
- 
- File "topfind.ml", line 317, characters 4-27:
- 317 |     Toploop.directive_table
-           ^^^^^^^^^^^^^^^^^^^^^^^
- Alert deprecated: Toploop.directive_table
- ocamlopt -I +compiler-libs -g -a -o findlib_top.cmxa topfind.cmx
- if [ 1 -gt 0 ]; then \
-     ocamlopt -I +compiler-libs -g -shared -o findlib_top.cmxs topfind.cmx; \
- fi
- ocamlopt -I +compiler-libs -g   -I +unix -I +dynlink -c fl_dynload.ml
- ocamlopt -I +compiler-libs -g -a -o findlib_dynload.cmxa fl_dynload.cmx
- if [ 1 -gt 0 ]; then \
-     ocamlopt -I +compiler-libs -g -shared -o findlib_dynload.cmxs fl_dynload.cmx; \
- fi
- make[1]: Leaving directory '/cygdrive/c/Users/opam/AppData/Local/opam/5.3/.opam-switch/build/ocamlfind.1.9.5/src/findlib'
-> compiled  ocamlfind.1.9.5
Processing 322/352: [ocamlbuild: make check-if-preinstalled]
Processing 323/352: [ocamlbuild: make check-if-preinstalled] [ocamlfind: make install]
+ C:\cygwin64\bin\make.exe "install" (CWD=C:\Users\opam\AppData\Local\opam\5.3\.opam-switch\build\ocamlfind.1.9.5)
- if [ "1" -eq 1 ]; then \
-     for x in camlp4 dbm graphics labltk num ocamlbuild; do \
-       if [ -f "C:\Users\opam\AppData\Local\opam\5.3\lib/$x/META" ]; then \
-         if ! grep -Fq '[distributed with Ocaml]' "/C:\Users\opam\AppData\Local\opam\5.3\lib/$x/META"; then \
-           rm -f site-lib-src/$x/META; \
-         fi; \
-       fi; \
-     done; \
-     test -f "site-lib-src/num/META" || rm -f "site-lib-src/num-top/META"; \
-   fi
- grep: /C:\Users\opam\AppData\Local\opam\5.3\lib/num/META: No such file or directory
- echo 'SITELIB_META =' > Makefile.packages.in
- for x in `ls site-lib-src`; do test ! -f "site-lib-src/$x/META" || echo $x >> Makefile.packages.in; done
- tr '\n' ' ' < Makefile.packages.in > Makefile.packages
- rm Makefile.packages.in
- install -d "C:\Users\opam\AppData\Local\opam\5.3\bin"
- install -d "C:\Users\opam\AppData\Local\opam\5.3\man"
- /usr/bin/make install-config
- make[1]: Entering directory '/cygdrive/c/Users/opam/AppData/Local/opam/5.3/.opam-switch/build/ocamlfind.1.9.5'
- install -d "`dirname \"C:\Users\opam\AppData\Local\opam\5.3\lib/findlib.conf\"`"
- test -f "C:\Users\opam\AppData\Local\opam\5.3\lib/findlib.conf" || install -c findlib.conf "C:\Users\opam\AppData\Local\opam\5.3\lib/findlib.conf"
- make[1]: Leaving directory '/cygdrive/c/Users/opam/AppData/Local/opam/5.3/.opam-switch/build/ocamlfind.1.9.5'
- for p in findlib; do ( cd src/$p; /usr/bin/make install ); done
- make[1]: Entering directory '/cygdrive/c/Users/opam/AppData/Local/opam/5.3/.opam-switch/build/ocamlfind.1.9.5/src/findlib'
- install -d "C:\Users\opam\AppData\Local\opam\5.3\lib/findlib"
- install -d "C:\Users\opam\AppData\Local\opam\5.3\bin"
- test 1 -eq 0 || install -d "/cygdrive/c/Users/opam/AppData/Local/opam/5.3/lib/ocaml"
- test 1 -eq 0 || install -c topfind "/cygdrive/c/Users/opam/AppData/Local/opam/5.3/lib/ocaml/"
- files=` ../../tools/collect_files ../../Makefile.config \
- findlib.cmi findlib.mli findlib.cma findlib.cmxa findlib.a findlib.cmxs \
- findlib_config.cmi findlib_config.ml topfind.cmi topfind.mli \
- fl_args.cmi fl_lint.cmi fl_meta.cmi fl_split.cmi fl_topo.cmi ocaml_args.cmi \
- fl_package_base.mli fl_package_base.cmi fl_metascanner.mli fl_metascanner.cmi \
- fl_metatoken.cmi findlib_top.cma findlib_top.cmxa findlib_top.a findlib_top.cmxs \
- findlib_dynload.cma findlib_dynload.cmxa findlib_dynload.a findlib_dynload.cmxs fl_dynload.mli fl_dynload.cmi \
- META` && \
- install -c $files "C:\Users\opam\AppData\Local\opam\5.3\lib/findlib/"
- f="ocamlfind.exe"; { test -f ocamlfind_opt.exe && f="ocamlfind_opt.exe"; }; \
- install -c $f "C:\Users\opam\AppData\Local\opam\5.3\bin/ocamlfind.exe"
- # the following "if" block is only needed for 4.00beta2
- if [ 1 -eq 0 -a -f "/cygdrive/c/Users/opam/AppData/Local/opam/5.3/lib/ocaml/compiler-libs/topdirs.cmi" ]; then \
-     cd "/cygdrive/c/Users/opam/AppData/Local/opam/5.3/lib/ocaml/compiler-libs/"; \
-     install -c topdirs.cmi toploop.cmi "C:\Users\opam\AppData\Local\opam\5.3\lib/findlib/"; \
- fi
- make[1]: Leaving directory '/cygdrive/c/Users/opam/AppData/Local/opam/5.3/.opam-switch/build/ocamlfind.1.9.5/src/findlib'
- /usr/bin/make install-meta
- make[1]: Entering directory '/cygdrive/c/Users/opam/AppData/Local/opam/5.3/.opam-switch/build/ocamlfind.1.9.5'
- for x in bytes compiler-libs dynlink ocamldoc runtime_events stdlib str threads unix ; do install -d "C:\Users\opam\AppData\Local\opam\5.3\lib/$x"; install -c site-lib-src/$x/META "C:\Users\opam\AppData\Local\opam\5.3\lib/$x/META.tmp" && mv "C:\Users\opam\AppData\Local\opam\5.3\lib/$x/META.tmp" "C:\Users\opam\AppData\Local\opam\5.3\lib/$x/META"; done
- install -d "C:\Users\opam\AppData\Local\opam\5.3\lib/findlib"; install -c Makefile.packages "C:\Users\opam\AppData\Local\opam\5.3\lib/findlib/Makefile.packages"
- make[1]: Leaving directory '/cygdrive/c/Users/opam/AppData/Local/opam/5.3/.opam-switch/build/ocamlfind.1.9.5'
- test ! -f 'site-lib-src/num-top/META' || { cd src/findlib; /usr/bin/make install-num-top; }
- test ! -f 'site-lib-src/camlp4/META' ||	install -c tools/safe_camlp4 "C:\Users\opam\AppData\Local\opam\5.3\bin"
- /usr/bin/make install-doc
- make[1]: Entering directory '/cygdrive/c/Users/opam/AppData/Local/opam/5.3/.opam-switch/build/ocamlfind.1.9.5'
- install -d "C:\Users\opam\AppData\Local\opam\5.3\man/man1" "C:\Users\opam\AppData\Local\opam\5.3\man/man3" "C:\Users\opam\AppData\Local\opam\5.3\man/man5"
- install -c doc/ref-man/ocamlfind.1 "C:\Users\opam\AppData\Local\opam\5.3\man/man1"
- install -c doc/ref-man/META.5 doc/ref-man/site-lib.5 doc/ref-man/findlib.conf.5 "C:\Users\opam\AppData\Local\opam\5.3\man/man5"
- make[1]: Leaving directory '/cygdrive/c/Users/opam/AppData/Local/opam/5.3/.opam-switch/build/ocamlfind.1.9.5'
[WARNING] .install file is missing .exe extension for src/findlib/ocamlfind
[WARNING] .install file is missing .exe extension for src/findlib/ocamlfind_opt
[WARNING] Automatically adding .exe to C:\Users\opam\AppData\Local\opam\5.3\.opam-switch\build\ocamlfind.1.9.5\src\findlib\ocamlfind.exe
[WARNING] Automatically adding .exe to C:\Users\opam\AppData\Local\opam\5.3\.opam-switch\build\ocamlfind.1.9.5\src\findlib\ocamlfind_opt.exe
[WARNING] C:\Users\opam\AppData\Local\opam\5.3\bin\safe_camlp4 is a script; the command won't be available
-> installed ocamlfind.1.9.5
Processing 323/352: [ocamlbuild: make check-if-preinstalled]
Processing 324/352: [ocamlbuild: make check-if-preinstalled] [zarith: ./configure]
+ C:\cygwin64\bin\make.exe "check-if-preinstalled" "all" "opam-install" (CWD=C:\Users\opam\AppData\Local\opam\5.3\.opam-switch\build\ocamlbuild.0.15.0)
- if test -d C:/Users/opam/AppData/Local/opam/5.3/lib/ocaml/ocamlbuild; then\
-   >&2 echo "ERROR: Preinstalled ocamlbuild detected at"\
-        "C:/Users/opam/AppData/Local/opam/5.3/lib/ocaml/ocamlbuild";\
-   >&2 echo "Installation aborted; if you want to bypass this"\
-         "safety check, pass CHECK_IF_PREINSTALLED=false to make";\
-   exit 2;\
- fi
- ocamlc.opt -w @14@29 -w +L -w +R -w +Z -I src -I plugin-lib -I bin -I +unix -safe-string -bin-annot -strict-sequence -c src/const.ml
- ocamlc.opt -w @14@29 -w +L -w +R -w +Z -I src -I plugin-lib -I bin -I +unix -safe-string -bin-annot -strict-sequence -c src/loc.mli
- ocamlc.opt -w @14@29 -w +L -w +R -w +Z -I src -I plugin-lib -I bin -I +unix -safe-string -bin-annot -strict-sequence -c src/loc.ml
- ocamlc.opt -w @14@29 -w +L -w +R -w +Z -I src -I plugin-lib -I bin -I +unix -safe-string -bin-annot -strict-sequence -c src/discard_printf.mli
- ocamlc.opt -w @14@29 -w +L -w +R -w +Z -I src -I plugin-lib -I bin -I +unix -safe-string -bin-annot -strict-sequence -c src/discard_printf.ml
- ocamlc.opt -w @14@29 -w +L -w +R -w +Z -I src -I plugin-lib -I bin -I +unix -safe-string -bin-annot -strict-sequence -c src/signatures.mli
- ocamlc.opt -w @14@29 -w +L -w +R -w +Z -I src -I plugin-lib -I bin -I +unix -safe-string -bin-annot -strict-sequence -c src/exit_codes.mli
- ocamlc.opt -w @14@29 -w +L -w +R -w +Z -I src -I plugin-lib -I bin -I +unix -safe-string -bin-annot -strict-sequence -c src/exit_codes.ml
- ocamlc.opt -w @14@29 -w +L -w +R -w +Z -I src -I plugin-lib -I bin -I +unix -safe-string -bin-annot -strict-sequence -c src/my_std.mli
- ocamlc.opt -w @14@29 -w +L -w +R -w +Z -I src -I plugin-lib -I bin -I +unix -safe-string -bin-annot -strict-sequence -c src/my_std.ml
- ocamlc.opt -w @14@29 -w +L -w +R -w +Z -I src -I plugin-lib -I bin -I +unix -safe-string -bin-annot -strict-sequence -c src/ocamlbuild_executor.mli
- ocamlc.opt -w @14@29 -w +L -w +R -w +Z -I src -I plugin-lib -I bin -I +unix -safe-string -bin-annot -strict-sequence -c src/ocamlbuild_executor.ml
- ocamlc.opt -w @14@29 -w +L -w +R -w +Z -I src -I plugin-lib -I bin -I +unix -safe-string -bin-annot -strict-sequence -c src/my_unix.mli
- ocamlc.opt -w @14@29 -w +L -w +R -w +Z -I src -I plugin-lib -I bin -I +unix -safe-string -bin-annot -strict-sequence -c src/my_unix.ml
- ocamlc.opt -w @14@29 -w +L -w +R -w +Z -I src -I plugin-lib -I bin -I +unix -safe-string -bin-annot -strict-sequence -c src/tags.mli
- ocamlc.opt -w @14@29 -w +L -w +R -w +Z -I src -I plugin-lib -I bin -I +unix -safe-string -bin-annot -strict-sequence -c src/tags.ml
- ocamlc.opt -w @14@29 -w +L -w +R -w +Z -I src -I plugin-lib -I bin -I +unix -safe-string -bin-annot -strict-sequence -c src/display.mli
- ocamlc.opt -w @14@29 -w +L -w +R -w +Z -I src -I plugin-lib -I bin -I +unix -safe-string -bin-annot -strict-sequence -c src/display.ml
- ocamlc.opt -w @14@29 -w +L -w +R -w +Z -I src -I plugin-lib -I bin -I +unix -safe-string -bin-annot -strict-sequence -c src/log.mli
- ocamlc.opt -w @14@29 -w +L -w +R -w +Z -I src -I plugin-lib -I bin -I +unix -safe-string -bin-annot -strict-sequence -c src/log.ml
- ocamlc.opt -w @14@29 -w +L -w +R -w +Z -I src -I plugin-lib -I bin -I +unix -safe-string -bin-annot -strict-sequence -c src/shell.mli
- ocamlc.opt -w @14@29 -w +L -w +R -w +Z -I src -I plugin-lib -I bin -I +unix -safe-string -bin-annot -strict-sequence -c src/shell.ml
- ocamlc.opt -w @14@29 -w +L -w +R -w +Z -I src -I plugin-lib -I bin -I +unix -safe-string -bin-annot -strict-sequence -c src/bool.mli
- ocamlc.opt -w @14@29 -w +L -w +R -w +Z -I src -I plugin-lib -I bin -I +unix -safe-string -bin-annot -strict-sequence -c src/bool.ml
- ocamlc.opt -w @14@29 -w +L -w +R -w +Z -I src -I plugin-lib -I bin -I +unix -safe-string -bin-annot -strict-sequence -c src/glob_ast.mli
- ocamlc.opt -w @14@29 -w +L -w +R -w +Z -I src -I plugin-lib -I bin -I +unix -safe-string -bin-annot -strict-sequence -c src/glob_ast.ml
- ocamllex.opt src/glob_lexer.mll
- 55 states, 419 transitions, table size 2006 bytes
- ocamlc.opt -w @14@29 -w +L -w +R -w +Z -I src -I plugin-lib -I bin -I +unix -safe-string -bin-annot -strict-sequence -c src/glob_lexer.mli
- ocamlc.opt -w @14@29 -w +L -w +R -w +Z -I src -I plugin-lib -I bin -I +unix -safe-string -bin-annot -strict-sequence -c src/glob_lexer.ml
- ocamlc.opt -w @14@29 -w +L -w +R -w +Z -I src -I plugin-lib -I bin -I +unix -safe-string -bin-annot -strict-sequence -c src/glob.mli
- ocamlc.opt -w @14@29 -w +L -w +R -w +Z -I src -I plugin-lib -I bin -I +unix -safe-string -bin-annot -strict-sequence -c src/glob.ml
- ocamllex.opt src/lexers.mll
- 235 states, 1033 transitions, table size 5542 bytes
- 4238 additional bytes used for bindings
- ocamlc.opt -w @14@29 -w +L -w +R -w +Z -I src -I plugin-lib -I bin -I +unix -safe-string -bin-annot -strict-sequence -c src/lexers.mli
- ocamlc.opt -w @14@29 -w +L -w +R -w +Z -I src -I plugin-lib -I bin -I +unix -safe-string -bin-annot -strict-sequence -c src/lexers.ml
- ocamlc.opt -w @14@29 -w +L -w +R -w +Z -I src -I plugin-lib -I bin -I +unix -safe-string -bin-annot -strict-sequence -c src/param_tags.mli
- ocamlc.opt -w @14@29 -w +L -w +R -w +Z -I src -I plugin-lib -I bin -I +unix -safe-string -bin-annot -strict-sequence -c src/param_tags.ml
- ocamlc.opt -w @14@29 -w +L -w +R -w +Z -I src -I plugin-lib -I bin -I +unix -safe-string -bin-annot -strict-sequence -c src/command.mli
- ocamlc.opt -w @14@29 -w +L -w +R -w +Z -I src -I plugin-lib -I bin -I +unix -safe-string -bin-annot -strict-sequence -c src/command.ml
- ocamlc.opt -w @14@29 -w +L -w +R -w +Z -I src -I plugin-lib -I bin -I +unix -safe-string -bin-annot -strict-sequence -c src/ocamlbuild_config.ml
- ocamlc.opt -w @14@29 -w +L -w +R -w +Z -I src -I plugin-lib -I bin -I +unix -safe-string -bin-annot -strict-sequence -c src/ocamlbuild_where.mli
- ocamlc.opt -w @14@29 -w +L -w +R -w +Z -I src -I plugin-lib -I bin -I +unix -safe-string -bin-annot -strict-sequence -c src/ocamlbuild_where.ml
- ocamlc.opt -w @14@29 -w +L -w +R -w +Z -I src -I plugin-lib -I bin -I +unix -safe-string -bin-annot -strict-sequence -c src/slurp.mli
- ocamlc.opt -w @14@29 -w +L -w +R -w +Z -I src -I plugin-lib -I bin -I +unix -safe-string -bin-annot -strict-sequence -c src/slurp.ml
- ocamlc.opt -w @14@29 -w +L -w +R -w +Z -I src -I plugin-lib -I bin -I +unix -safe-string -bin-annot -strict-sequence -c src/options.mli
- ocamlc.opt -w @14@29 -w +L -w +R -w +Z -I src -I plugin-lib -I bin -I +unix -safe-string -bin-annot -strict-sequence -c src/options.ml
- ocamlc.opt -w @14@29 -w +L -w +R -w +Z -I src -I plugin-lib -I bin -I +unix -safe-string -bin-annot -strict-sequence -c src/pathname.mli
- ocamlc.opt -w @14@29 -w +L -w +R -w +Z -I src -I plugin-lib -I bin -I +unix -safe-string -bin-annot -strict-sequence -c src/pathname.ml
- ocamlc.opt -w @14@29 -w +L -w +R -w +Z -I src -I plugin-lib -I bin -I +unix -safe-string -bin-annot -strict-sequence -c src/configuration.mli
- ocamlc.opt -w @14@29 -w +L -w +R -w +Z -I src -I plugin-lib -I bin -I +unix -safe-string -bin-annot -strict-sequence -c src/configuration.ml
- ocamlc.opt -w @14@29 -w +L -w +R -w +Z -I src -I plugin-lib -I bin -I +unix -safe-string -bin-annot -strict-sequence -c src/flags.mli
- ocamlc.opt -w @14@29 -w +L -w +R -w +Z -I src -I plugin-lib -I bin -I +unix -safe-string -bin-annot -strict-sequence -c src/flags.ml
- ocamlc.opt -w @14@29 -w +L -w +R -w +Z -I src -I plugin-lib -I bin -I +unix -safe-string -bin-annot -strict-sequence -c src/hygiene.mli
- ocamlc.opt -w @14@29 -w +L -w +R -w +Z -I src -I plugin-lib -I bin -I +unix -safe-string -bin-annot -strict-sequence -c src/hygiene.ml
- ocamlc.opt -w @14@29 -w +L -w +R -w +Z -I src -I plugin-lib -I bin -I +unix -safe-string -bin-annot -strict-sequence -c src/digest_cache.mli
- ocamlc.opt -w @14@29 -w +L -w +R -w +Z -I src -I plugin-lib -I bin -I +unix -safe-string -bin-annot -strict-sequence -c src/digest_cache.ml
- ocamlc.opt -w @14@29 -w +L -w +R -w +Z -I src -I plugin-lib -I bin -I +unix -safe-string -bin-annot -strict-sequence -c src/resource.mli
- ocamlc.opt -w @14@29 -w +L -w +R -w +Z -I src -I plugin-lib -I bin -I +unix -safe-string -bin-annot -strict-sequence -c src/resource.ml
- ocamlc.opt -w @14@29 -w +L -w +R -w +Z -I src -I plugin-lib -I bin -I +unix -safe-string -bin-annot -strict-sequence -c src/rule.mli
- ocamlc.opt -w @14@29 -w +L -w +R -w +Z -I src -I plugin-lib -I bin -I +unix -safe-string -bin-annot -strict-sequence -c src/rule.ml
- ocamlc.opt -w @14@29 -w +L -w +R -w +Z -I src -I plugin-lib -I bin -I +unix -safe-string -bin-annot -strict-sequence -c src/solver.mli
- ocamlc.opt -w @14@29 -w +L -w +R -w +Z -I src -I plugin-lib -I bin -I +unix -safe-string -bin-annot -strict-sequence -c src/solver.ml
- ocamlc.opt -w @14@29 -w +L -w +R -w +Z -I src -I plugin-lib -I bin -I +unix -safe-string -bin-annot -strict-sequence -c src/report.mli
- ocamlc.opt -w @14@29 -w +L -w +R -w +Z -I src -I plugin-lib -I bin -I +unix -safe-string -bin-annot -strict-sequence -c src/report.ml
- ocamlc.opt -w @14@29 -w +L -w +R -w +Z -I src -I plugin-lib -I bin -I +unix -safe-string -bin-annot -strict-sequence -c src/tools.mli
- ocamlc.opt -w @14@29 -w +L -w +R -w +Z -I src -I plugin-lib -I bin -I +unix -safe-string -bin-annot -strict-sequence -c src/tools.ml
- ocamlc.opt -w @14@29 -w +L -w +R -w +Z -I src -I plugin-lib -I bin -I +unix -safe-string -bin-annot -strict-sequence -c src/fda.mli
- ocamlc.opt -w @14@29 -w +L -w +R -w +Z -I src -I plugin-lib -I bin -I +unix -safe-string -bin-annot -strict-sequence -c src/fda.ml
- ocamlc.opt -w @14@29 -w +L -w +R -w +Z -I src -I plugin-lib -I bin -I +unix -safe-string -bin-annot -strict-sequence -c src/findlib.mli
- ocamlc.opt -w @14@29 -w +L -w +R -w +Z -I src -I plugin-lib -I bin -I +unix -safe-string -bin-annot -strict-sequence -c src/findlib.ml
- ocamlc.opt -w @14@29 -w +L -w +R -w +Z -I src -I plugin-lib -I bin -I +unix -safe-string -bin-annot -strict-sequence -c src/ocaml_arch.mli
- ocamlc.opt -w @14@29 -w +L -w +R -w +Z -I src -I plugin-lib -I bin -I +unix -safe-string -bin-annot -strict-sequence -c src/ocaml_arch.ml
- ocamlc.opt -w @14@29 -w +L -w +R -w +Z -I src -I plugin-lib -I bin -I +unix -safe-string -bin-annot -strict-sequence -c src/ocaml_utils.mli
- ocamlc.opt -w @14@29 -w +L -w +R -w +Z -I src -I plugin-lib -I bin -I +unix -safe-string -bin-annot -strict-sequence -c src/ocaml_utils.ml
- ocamlc.opt -w @14@29 -w +L -w +R -w +Z -I src -I plugin-lib -I bin -I +unix -safe-string -bin-annot -strict-sequence -c src/ocaml_dependencies.mli
- ocamlc.opt -w @14@29 -w +L -w +R -w +Z -I src -I plugin-lib -I bin -I +unix -safe-string -bin-annot -strict-sequence -c src/ocaml_dependencies.ml
- ocamlc.opt -w @14@29 -w +L -w +R -w +Z -I src -I plugin-lib -I bin -I +unix -safe-string -bin-annot -strict-sequence -c src/ocaml_compiler.mli
- ocamlc.opt -w @14@29 -w +L -w +R -w +Z -I src -I plugin-lib -I bin -I +unix -safe-string -bin-annot -strict-sequence -c src/ocaml_compiler.ml
- ocamlc.opt -w @14@29 -w +L -w +R -w +Z -I src -I plugin-lib -I bin -I +unix -safe-string -bin-annot -strict-sequence -c src/ocaml_tools.mli
- ocamlc.opt -w @14@29 -w +L -w +R -w +Z -I src -I plugin-lib -I bin -I +unix -safe-string -bin-annot -strict-sequence -c src/ocaml_tools.ml
- ocamlc.opt -w @14@29 -w +L -w +R -w +Z -I src -I plugin-lib -I bin -I +unix -safe-string -bin-annot -strict-sequence -c src/ocaml_specific.mli
- ocamlc.opt -w @14@29 -w +L -w +R -w +Z -I src -I plugin-lib -I bin -I +unix -safe-string -bin-annot -strict-sequence -c src/ocaml_specific.ml
- ocamlc.opt -w @14@29 -w +L -w +R -w +Z -I src -I plugin-lib -I bin -I +unix -safe-string -bin-annot -strict-sequence -c src/plugin.mli
- ocamlc.opt -w @14@29 -w +L -w +R -w +Z -I src -I plugin-lib -I bin -I +unix -safe-string -bin-annot -strict-sequence -c src/plugin.ml
- ocamlc.opt -w @14@29 -w +L -w +R -w +Z -I src -I plugin-lib -I bin -I +unix -safe-string -bin-annot -strict-sequence -c src/hooks.mli
- ocamlc.opt -w @14@29 -w +L -w +R -w +Z -I src -I plugin-lib -I bin -I +unix -safe-string -bin-annot -strict-sequence -c src/hooks.ml
- ocamlc.opt -w @14@29 -w +L -w +R -w +Z -I src -I plugin-lib -I bin -I +unix -safe-string -bin-annot -strict-sequence -c src/main.mli
- ocamlc.opt -w @14@29 -w +L -w +R -w +Z -I src -I plugin-lib -I bin -I +unix -safe-string -bin-annot -strict-sequence -c src/main.ml
- mkdir -p tmp
- ocamlc.opt -pack src/const.cmo src/loc.cmo src/discard_printf.cmo src/signatures.cmi src/exit_codes.cmo src/my_std.cmo src/ocamlbuild_executor.cmo src/my_unix.cmo src/tags.cmo src/display.cmo src/log.cmo src/shell.cmo src/bool.cmo src/glob_ast.cmo src/glob_lexer.cmo src/glob.cmo src/lexers.cmo src/param_tags.cmo src/command.cmo src/ocamlbuild_config.cmo src/ocamlbuild_where.cmo src/slurp.cmo src/options.cmo src/pathname.cmo src/configuration.cmo src/flags.cmo src/hygiene.cmo src/digest_cache.cmo src/resource.cmo src/rule.cmo src/solver.cmo src/report.cmo src/tools.cmo src/fda.cmo src/findlib.cmo src/ocaml_arch.cmo src/ocaml_utils.cmo src/ocaml_dependencies.cmo src/ocaml_compiler.cmo src/ocaml_tools.cmo src/ocaml_specific.cmo src/plugin.cmo src/hooks.cmo src/main.cmo -o tmp/ocamlbuild_pack.cmo
- mv tmp/ocamlbuild_pack.cmi src/ocamlbuild_pack.cmi
- mv tmp/ocamlbuild_pack.cmo src/ocamlbuild_pack.cmo
- ocamlc.opt -w @14@29 -w +L -w +R -w +Z -I src -I plugin-lib -I bin -I +unix -safe-string -bin-annot -strict-sequence -c plugin-lib/ocamlbuild_plugin.mli
- ocamlc.opt -w @14@29 -w +L -w +R -w +Z -I src -I plugin-lib -I bin -I +unix -safe-string -bin-annot -strict-sequence -c plugin-lib/ocamlbuild_plugin.ml
- ocamlc.opt -w @14@29 -w +L -w +R -w +Z -I src -I plugin-lib -I bin -I +unix -safe-string -bin-annot -strict-sequence -c plugin-lib/ocamlbuild_unix_plugin.ml
- ocamlc.opt -w @14@29 -w +L -w +R -w +Z -I src -I plugin-lib -I bin -I +unix -safe-string -bin-annot -strict-sequence -c bin/ocamlbuild.mli
- ocamlc.opt -w @14@29 -w +L -w +R -w +Z -I src -I plugin-lib -I bin -I +unix -safe-string -bin-annot -strict-sequence -c bin/ocamlbuild.ml
- ocamlc.opt -I +unix -I src -o ocamlbuild.byte -I +unix unix.cma src/ocamlbuild_pack.cmo plugin-lib/ocamlbuild_plugin.cmo plugin-lib/ocamlbuild_unix_plugin.cmo bin/ocamlbuild.cmo
- ocamlc.opt -a -o plugin-lib/ocamlbuildlib.cma src/ocamlbuild_pack.cmo plugin-lib/ocamlbuild_plugin.cmo plugin-lib/ocamlbuild_unix_plugin.cmo
- ocamlopt.opt -for-pack Ocamlbuild_pack -w @14@29 -w +L -w +R -w +Z -I src -I plugin-lib -I bin -I +unix -safe-string -bin-annot -strict-sequence -c src/const.ml
- ocamlopt.opt -for-pack Ocamlbuild_pack -w @14@29 -w +L -w +R -w +Z -I src -I plugin-lib -I bin -I +unix -safe-string -bin-annot -strict-sequence -c src/loc.ml
- ocamlopt.opt -for-pack Ocamlbuild_pack -w @14@29 -w +L -w +R -w +Z -I src -I plugin-lib -I bin -I +unix -safe-string -bin-annot -strict-sequence -c src/discard_printf.ml
- ocamlopt.opt -for-pack Ocamlbuild_pack -w @14@29 -w +L -w +R -w +Z -I src -I plugin-lib -I bin -I +unix -safe-string -bin-annot -strict-sequence -c src/exit_codes.ml
- ocamlopt.opt -for-pack Ocamlbuild_pack -w @14@29 -w +L -w +R -w +Z -I src -I plugin-lib -I bin -I +unix -safe-string -bin-annot -strict-sequence -c src/my_std.ml
- ocamlopt.opt -for-pack Ocamlbuild_pack -w @14@29 -w +L -w +R -w +Z -I src -I plugin-lib -I bin -I +unix -safe-string -bin-annot -strict-sequence -c src/ocamlbuild_executor.ml
- ocamlopt.opt -for-pack Ocamlbuild_pack -w @14@29 -w +L -w +R -w +Z -I src -I plugin-lib -I bin -I +unix -safe-string -bin-annot -strict-sequence -c src/my_unix.ml
- ocamlopt.opt -for-pack Ocamlbuild_pack -w @14@29 -w +L -w +R -w +Z -I src -I plugin-lib -I bin -I +unix -safe-string -bin-annot -strict-sequence -c src/tags.ml
- ocamlopt.opt -for-pack Ocamlbuild_pack -w @14@29 -w +L -w +R -w +Z -I src -I plugin-lib -I bin -I +unix -safe-string -bin-annot -strict-sequence -c src/display.ml
- ocamlopt.opt -for-pack Ocamlbuild_pack -w @14@29 -w +L -w +R -w +Z -I src -I plugin-lib -I bin -I +unix -safe-string -bin-annot -strict-sequence -c src/log.ml
- ocamlopt.opt -for-pack Ocamlbuild_pack -w @14@29 -w +L -w +R -w +Z -I src -I plugin-lib -I bin -I +unix -safe-string -bin-annot -strict-sequence -c src/shell.ml
- ocamlopt.opt -for-pack Ocamlbuild_pack -w @14@29 -w +L -w +R -w +Z -I src -I plugin-lib -I bin -I +unix -safe-string -bin-annot -strict-sequence -c src/bool.ml
- ocamlopt.opt -for-pack Ocamlbuild_pack -w @14@29 -w +L -w +R -w +Z -I src -I plugin-lib -I bin -I +unix -safe-string -bin-annot -strict-sequence -c src/glob_ast.ml
- ocamlopt.opt -for-pack Ocamlbuild_pack -w @14@29 -w +L -w +R -w +Z -I src -I plugin-lib -I bin -I +unix -safe-string -bin-annot -strict-sequence -c src/glob_lexer.ml
- ocamlopt.opt -for-pack Ocamlbuild_pack -w @14@29 -w +L -w +R -w +Z -I src -I plugin-lib -I bin -I +unix -safe-string -bin-annot -strict-sequence -c src/glob.ml
- ocamlopt.opt -for-pack Ocamlbuild_pack -w @14@29 -w +L -w +R -w +Z -I src -I plugin-lib -I bin -I +unix -safe-string -bin-annot -strict-sequence -c src/lexers.ml
- ocamlopt.opt -for-pack Ocamlbuild_pack -w @14@29 -w +L -w +R -w +Z -I src -I plugin-lib -I bin -I +unix -safe-string -bin-annot -strict-sequence -c src/param_tags.ml
- ocamlopt.opt -for-pack Ocamlbuild_pack -w @14@29 -w +L -w +R -w +Z -I src -I plugin-lib -I bin -I +unix -safe-string -bin-annot -strict-sequence -c src/command.ml
- ocamlopt.opt -for-pack Ocamlbuild_pack -w @14@29 -w +L -w +R -w +Z -I src -I plugin-lib -I bin -I +unix -safe-string -bin-annot -strict-sequence -c src/ocamlbuild_config.ml
- ocamlopt.opt -for-pack Ocamlbuild_pack -w @14@29 -w +L -w +R -w +Z -I src -I plugin-lib -I bin -I +unix -safe-string -bin-annot -strict-sequence -c src/ocamlbuild_where.ml
- ocamlopt.opt -for-pack Ocamlbuild_pack -w @14@29 -w +L -w +R -w +Z -I src -I plugin-lib -I bin -I +unix -safe-string -bin-annot -strict-sequence -c src/slurp.ml
- ocamlopt.opt -for-pack Ocamlbuild_pack -w @14@29 -w +L -w +R -w +Z -I src -I plugin-lib -I bin -I +unix -safe-string -bin-annot -strict-sequence -c src/options.ml
- ocamlopt.opt -for-pack Ocamlbuild_pack -w @14@29 -w +L -w +R -w +Z -I src -I plugin-lib -I bin -I +unix -safe-string -bin-annot -strict-sequence -c src/pathname.ml
- ocamlopt.opt -for-pack Ocamlbuild_pack -w @14@29 -w +L -w +R -w +Z -I src -I plugin-lib -I bin -I +unix -safe-string -bin-annot -strict-sequence -c src/configuration.ml
- ocamlopt.opt -for-pack Ocamlbuild_pack -w @14@29 -w +L -w +R -w +Z -I src -I plugin-lib -I bin -I +unix -safe-string -bin-annot -strict-sequence -c src/flags.ml
- ocamlopt.opt -for-pack Ocamlbuild_pack -w @14@29 -w +L -w +R -w +Z -I src -I plugin-lib -I bin -I +unix -safe-string -bin-annot -strict-sequence -c src/hygiene.ml
- ocamlopt.opt -for-pack Ocamlbuild_pack -w @14@29 -w +L -w +R -w +Z -I src -I plugin-lib -I bin -I +unix -safe-string -bin-annot -strict-sequence -c src/digest_cache.ml
- ocamlopt.opt -for-pack Ocamlbuild_pack -w @14@29 -w +L -w +R -w +Z -I src -I plugin-lib -I bin -I +unix -safe-string -bin-annot -strict-sequence -c src/resource.ml
- ocamlopt.opt -for-pack Ocamlbuild_pack -w @14@29 -w +L -w +R -w +Z -I src -I plugin-lib -I bin -I +unix -safe-string -bin-annot -strict-sequence -c src/rule.ml
- ocamlopt.opt -for-pack Ocamlbuild_pack -w @14@29 -w +L -w +R -w +Z -I src -I plugin-lib -I bin -I +unix -safe-string -bin-annot -strict-sequence -c src/solver.ml
- ocamlopt.opt -for-pack Ocamlbuild_pack -w @14@29 -w +L -w +R -w +Z -I src -I plugin-lib -I bin -I +unix -safe-string -bin-annot -strict-sequence -c src/report.ml
- ocamlopt.opt -for-pack Ocamlbuild_pack -w @14@29 -w +L -w +R -w +Z -I src -I plugin-lib -I bin -I +unix -safe-string -bin-annot -strict-sequence -c src/tools.ml
- ocamlopt.opt -for-pack Ocamlbuild_pack -w @14@29 -w +L -w +R -w +Z -I src -I plugin-lib -I bin -I +unix -safe-string -bin-annot -strict-sequence -c src/fda.ml
- ocamlopt.opt -for-pack Ocamlbuild_pack -w @14@29 -w +L -w +R -w +Z -I src -I plugin-lib -I bin -I +unix -safe-string -bin-annot -strict-sequence -c src/findlib.ml
- ocamlopt.opt -for-pack Ocamlbuild_pack -w @14@29 -w +L -w +R -w +Z -I src -I plugin-lib -I bin -I +unix -safe-string -bin-annot -strict-sequence -c src/ocaml_arch.ml
- ocamlopt.opt -for-pack Ocamlbuild_pack -w @14@29 -w +L -w +R -w +Z -I src -I plugin-lib -I bin -I +unix -safe-string -bin-annot -strict-sequence -c src/ocaml_utils.ml
- ocamlopt.opt -for-pack Ocamlbuild_pack -w @14@29 -w +L -w +R -w +Z -I src -I plugin-lib -I bin -I +unix -safe-string -bin-annot -strict-sequence -c src/ocaml_dependencies.ml
- ocamlopt.opt -for-pack Ocamlbuild_pack -w @14@29 -w +L -w +R -w +Z -I src -I plugin-lib -I bin -I +unix -safe-string -bin-annot -strict-sequence -c src/ocaml_compiler.ml
- ocamlopt.opt -for-pack Ocamlbuild_pack -w @14@29 -w +L -w +R -w +Z -I src -I plugin-lib -I bin -I +unix -safe-string -bin-annot -strict-sequence -c src/ocaml_tools.ml
- ocamlopt.opt -for-pack Ocamlbuild_pack -w @14@29 -w +L -w +R -w +Z -I src -I plugin-lib -I bin -I +unix -safe-string -bin-annot -strict-sequence -c src/ocaml_specific.ml
- ocamlopt.opt -for-pack Ocamlbuild_pack -w @14@29 -w +L -w +R -w +Z -I src -I plugin-lib -I bin -I +unix -safe-string -bin-annot -strict-sequence -c src/plugin.ml
- ocamlopt.opt -for-pack Ocamlbuild_pack -w @14@29 -w +L -w +R -w +Z -I src -I plugin-lib -I bin -I +unix -safe-string -bin-annot -strict-sequence -c src/hooks.ml
- ocamlopt.opt -for-pack Ocamlbuild_pack -w @14@29 -w +L -w +R -w +Z -I src -I plugin-lib -I bin -I +unix -safe-string -bin-annot -strict-sequence -c src/main.ml
- mkdir -p tmp
- ocamlopt.opt -pack src/const.cmx src/loc.cmx src/discard_printf.cmx src/signatures.cmi src/exit_codes.cmx src/my_std.cmx src/ocamlbuild_executor.cmx src/my_unix.cmx src/tags.cmx src/display.cmx src/log.cmx src/shell.cmx src/bool.cmx src/glob_ast.cmx src/glob_lexer.cmx src/glob.cmx src/lexers.cmx src/param_tags.cmx src/command.cmx src/ocamlbuild_config.cmx src/ocamlbuild_where.cmx src/slurp.cmx src/options.cmx src/pathname.cmx src/configuration.cmx src/flags.cmx src/hygiene.cmx src/digest_cache.cmx src/resource.cmx src/rule.cmx src/solver.cmx src/report.cmx src/tools.cmx src/fda.cmx src/findlib.cmx src/ocaml_arch.cmx src/ocaml_utils.cmx src/ocaml_dependencies.cmx src/ocaml_compiler.cmx src/ocaml_tools.cmx src/ocaml_specific.cmx src/plugin.cmx src/hooks.cmx src/main.cmx -o tmp/ocamlbuild_pack.cmx
- mv tmp/ocamlbuild_pack.cmx src/ocamlbuild_pack.cmx
- mv tmp/ocamlbuild_pack.o src/ocamlbuild_pack.o
- ocamlopt.opt -w @14@29 -w +L -w +R -w +Z -I src -I plugin-lib -I bin -I +unix -safe-string -bin-annot -strict-sequence -c plugin-lib/ocamlbuild_plugin.ml
- ocamlopt.opt -w @14@29 -w +L -w +R -w +Z -I src -I plugin-lib -I bin -I +unix -safe-string -bin-annot -strict-sequence -c plugin-lib/ocamlbuild_unix_plugin.ml
- ocamlopt.opt -w @14@29 -w +L -w +R -w +Z -I src -I plugin-lib -I bin -I +unix -safe-string -bin-annot -strict-sequence -c bin/ocamlbuild.ml
- ocamlopt.opt -I +unix -I src -o ocamlbuild.native -I +unix unix.cmxa src/ocamlbuild_pack.cmx plugin-lib/ocamlbuild_plugin.cmx plugin-lib/ocamlbuild_unix_plugin.cmx bin/ocamlbuild.cmx
- ocamlopt.opt -a -o plugin-lib/ocamlbuildlib.cmxa src/ocamlbuild_pack.cmx plugin-lib/ocamlbuild_plugin.cmx plugin-lib/ocamlbuild_unix_plugin.cmx
- ocamlc.opt -I +unix unix.cma src/ocamlbuild_pack.cmo -I src man/options_man.ml -o man/options_man.byte
- ./man/options_man.byte > man/ocamlbuild.options.1
- cat man/ocamlbuild.header.1 man/ocamlbuild.options.1 man/ocamlbuild.footer.1 > man/ocamlbuild.1
- /usr/bin/make ocamlbuild.install
- make[1]: Entering directory '/cygdrive/c/Users/opam/AppData/Local/opam/5.3/.opam-switch/build/ocamlbuild.0.15.0'
- rm -f ocamlbuild.install
- touch ocamlbuild.install
- /usr/bin/make install-bin-opam
- make[2]: Entering directory '/cygdrive/c/Users/opam/AppData/Local/opam/5.3/.opam-switch/build/ocamlbuild.0.15.0'
- echo 'bin: [' >> ocamlbuild.install
- echo '  "ocamlbuild.byte" {"ocamlbuild.byte.exe"}' >> ocamlbuild.install
- echo '  "ocamlbuild.native" {"ocamlbuild.native.exe"}' >> ocamlbuild.install
- echo '  "ocamlbuild.native" {"ocamlbuild.exe"}' >> ocamlbuild.install
- echo ']' >> ocamlbuild.install
- echo >> ocamlbuild.install
- make[2]: Leaving directory '/cygdrive/c/Users/opam/AppData/Local/opam/5.3/.opam-switch/build/ocamlbuild.0.15.0'
- /usr/bin/make install-lib-opam
- make[2]: Entering directory '/cygdrive/c/Users/opam/AppData/Local/opam/5.3/.opam-switch/build/ocamlbuild.0.15.0'
- echo 'lib: [' >> ocamlbuild.install
- /usr/bin/make install-lib-basics-opam
- make[3]: Entering directory '/cygdrive/c/Users/opam/AppData/Local/opam/5.3/.opam-switch/build/ocamlbuild.0.15.0'
- echo '  "ocamlbuild.opam" {"opam"}' >> ocamlbuild.install
- echo '  "META"' >> ocamlbuild.install
- for lib in src/signatures.mli src/signatures.cmi src/signatures.cmti; do \
-   echo "  \"$lib\" {\"$(basename $lib)\"}" >> ocamlbuild.install; \
- done
- make[3]: Leaving directory '/cygdrive/c/Users/opam/AppData/Local/opam/5.3/.opam-switch/build/ocamlbuild.0.15.0'
- /usr/bin/make install-lib-byte-opam
- make[3]: Entering directory '/cygdrive/c/Users/opam/AppData/Local/opam/5.3/.opam-switch/build/ocamlbuild.0.15.0'
- for lib in plugin-lib/ocamlbuildlib.cma bin/ocamlbuild.cmo src/ocamlbuild_pack.cmi plugin-lib/ocamlbuild_plugin.cmi plugin-lib/ocamlbuild_unix_plugin.cmi; do \
-   echo "  \"$lib\" {\"$(basename $lib)\"}" >> ocamlbuild.install; \
- done
- make[3]: Leaving directory '/cygdrive/c/Users/opam/AppData/Local/opam/5.3/.opam-switch/build/ocamlbuild.0.15.0'
- /usr/bin/make install-lib-native-opam
- make[3]: Entering directory '/cygdrive/c/Users/opam/AppData/Local/opam/5.3/.opam-switch/build/ocamlbuild.0.15.0'
- for lib in plugin-lib/ocamlbuildlib.cmxa plugin-lib/ocamlbuildlib.a bin/ocamlbuild.cmx bin/ocamlbuild.o src/ocamlbuild_pack.cmx plugin-lib/ocamlbuild_plugin.cmx plugin-lib/ocamlbuild_unix_plugin.cmx plugin-lib/ocamlbuild_plugin.o plugin-lib/ocamlbuild_unix_plugin.o; do \
-   echo "  \"$lib\" {\"$(basename $lib)\"}" >> ocamlbuild.install; \
- done
- make[3]: Leaving directory '/cygdrive/c/Users/opam/AppData/Local/opam/5.3/.opam-switch/build/ocamlbuild.0.15.0'
- echo ']' >> ocamlbuild.install
- echo >> ocamlbuild.install
- make[2]: Leaving directory '/cygdrive/c/Users/opam/AppData/Local/opam/5.3/.opam-switch/build/ocamlbuild.0.15.0'
- /usr/bin/make install-man-opam
- make[2]: Entering directory '/cygdrive/c/Users/opam/AppData/Local/opam/5.3/.opam-switch/build/ocamlbuild.0.15.0'
- echo 'man: [' >> ocamlbuild.install
- echo '  "man/ocamlbuild.1" {"man1/ocamlbuild.1"}' >> ocamlbuild.install
- echo ']' >> ocamlbuild.install
- echo >> ocamlbuild.install
- make[2]: Leaving directory '/cygdrive/c/Users/opam/AppData/Local/opam/5.3/.opam-switch/build/ocamlbuild.0.15.0'
- /usr/bin/make install-doc-opam
- make[2]: Entering directory '/cygdrive/c/Users/opam/AppData/Local/opam/5.3/.opam-switch/build/ocamlbuild.0.15.0'
- echo 'doc: [' >> ocamlbuild.install
- echo '  "LICENSE"' >> ocamlbuild.install
- echo '  "Changes"' >> ocamlbuild.install
- echo '  "Readme.md"' >> ocamlbuild.install
- echo ']' >> ocamlbuild.install
- make[2]: Leaving directory '/cygdrive/c/Users/opam/AppData/Local/opam/5.3/.opam-switch/build/ocamlbuild.0.15.0'
- make[1]: Leaving directory '/cygdrive/c/Users/opam/AppData/Local/opam/5.3/.opam-switch/build/ocamlbuild.0.15.0'
-> compiled  ocamlbuild.0.15.0
Processing 324/352: [zarith: ./configure]
-> installed ocamlbuild.0.15.0
Processing 325/352: [zarith: ./configure]
Processing 326/352: [topkg: ocaml build] [zarith: ./configure]
+ C:\Users\opam\AppData\Local\opam\5.3\.opam-switch\build\zarith.1.14\./configure  (CWD=C:\Users\opam\AppData\Local\opam\5.3\.opam-switch\build\zarith.1.14)
- binary ocaml: found in /cygdrive/c/Users/opam/AppData/Local/opam/5.3/bin
- binary ocamlc: found in /cygdrive/c/Users/opam/AppData/Local/opam/5.3/bin
- binary ocamldep: found in /cygdrive/c/Users/opam/AppData/Local/opam/5.3/bin
- binary ocamlmklib: found in /cygdrive/c/Users/opam/AppData/Local/opam/5.3/bin
- binary ocamldoc: found in /cygdrive/c/Users/opam/AppData/Local/opam/5.3/bin
- binary ocamlopt: found in /cygdrive/c/Users/opam/AppData/Local/opam/5.3/bin
- checking compilation with ocamlc -O3 -Wall -Wextra : working
- include caml/mlvalues.h: found
- library dynlink.cmxa: found
- binary ocamlfind: found in /cygdrive/c/Users/opam/AppData/Local/opam/5.3/bin
- OCaml's word size is 64
- include gmp.h: found
- library gmp: found
- OCaml supports -bin-annot to produce documentation
- 
- detected configuration:
- 
-   native-code:          yes
-   dynamic linking:      yes
-   defines:              -DHAS_GMP 
-   includes:             -IC:/Users/opam/AppData/Local/opam/5.3/lib/ocaml 
-   libraries:             -lgmp
-   linker options:       
-   C options:            -O3 -Wall -Wextra 
-   installation path:    C:\Users\opam\AppData\Local\opam\5.3\lib
-   installation method   findlib
- 
- configuration successful!
- now type "make" to build
- then type "make install" or "sudo make install" to install
Processing 326/352: [topkg: ocaml build] [zarith: make]
+ C:\cygwin64\bin\make.exe  (CWD=C:\Users\opam\AppData\Local\opam\5.3\.opam-switch\build\zarith.1.14)
- (echo "let"; grep "version" META | head -1) > zarith_version.ml
- ocamldep  zarith_version.ml z.ml q.ml big_int_Z.ml z.mli q.mli big_int_Z.mli > depend
- ocamlc -g -I +compiler-libs -bin-annot  -c zarith_version.ml
- ocamlc -g -I +compiler-libs -bin-annot  -c z.mli
- ocamlc -g -I +compiler-libs -bin-annot  -c z.ml
- ocamlc -g -I +compiler-libs -bin-annot  -c q.mli
- ocamlc -g -I +compiler-libs -bin-annot  -c q.ml
- ocamlc -g -I +compiler-libs -bin-annot  -c big_int_Z.mli
- ocamlc -g -I +compiler-libs -bin-annot  -c big_int_Z.ml
- ocamlmklib -g -failsafe -o zarith zarith_version.cmo z.cmo q.cmo big_int_Z.cmo -lgmp 
- ocamlc -ccopt "-IC:/Users/opam/AppData/Local/opam/5.3/lib/ocaml  -DHAS_GMP  -O3 -Wall -Wextra " -c caml_z.c
- ocamlmklib -g -failsafe -o zarith caml_z.o -lgmp 
- ocamlc -g -I +compiler-libs -bin-annot  -c zarith_top.ml
- ocamlc -g -o zarith_top.cma -a zarith_top.cmo
- ocamlopt -g -I +compiler-libs  -c zarith_version.ml
- ocamlopt -g -I +compiler-libs  -c z.ml
- ocamlopt -g -I +compiler-libs  -c q.ml
- ocamlopt -g -I +compiler-libs  -c big_int_Z.ml
- ocamlmklib -g -failsafe -o zarith zarith_version.cmx z.cmx q.cmx big_int_Z.cmx -lgmp 
- ocamlopt -shared -o zarith.cmxs -I . zarith.cmxa -linkall
-> compiled  zarith.1.14
Processing 326/352: [topkg: ocaml build]
Processing 327/352: [topkg: ocaml build] [zarith: make install]
+ C:\cygwin64\bin\make.exe "install" (CWD=C:\Users\opam\AppData\Local\opam\5.3\.opam-switch\build\zarith.1.14)
- ocamlfind install -destdir "C:\Users\opam\AppData\Local\opam\5.3\lib" zarith META zarith.cma libzarith.a z.cmi q.cmi big_int_Z.cmi zarith_top.cma z.mli zarith.cmxa zarith_version.cmx z.cmx q.cmx big_int_Z.cmx zarith.cmxs zarith.h q.mli big_int_Z.mli zarith.a z.cmti q.cmti big_int_Z.cmti -optional dllzarith.dll
- Installed C:\Users\opam\AppData\Local\opam\5.3\lib\zarith\big_int_Z.cmti
- Installed C:\Users\opam\AppData\Local\opam\5.3\lib\zarith\q.cmti
- Installed C:\Users\opam\AppData\Local\opam\5.3\lib\zarith\z.cmti
- Installed C:\Users\opam\AppData\Local\opam\5.3\lib\zarith\zarith.a
- Installed C:\Users\opam\AppData\Local\opam\5.3\lib\zarith\big_int_Z.mli
- Installed C:\Users\opam\AppData\Local\opam\5.3\lib\zarith\q.mli
- Installed C:\Users\opam\AppData\Local\opam\5.3\lib\zarith\zarith.h
- Installed C:\Users\opam\AppData\Local\opam\5.3\lib\zarith\zarith.cmxs
- Installed C:\Users\opam\AppData\Local\opam\5.3\lib\zarith\big_int_Z.cmx
- Installed C:\Users\opam\AppData\Local\opam\5.3\lib\zarith\q.cmx
- Installed C:\Users\opam\AppData\Local\opam\5.3\lib\zarith\z.cmx
- Installed C:\Users\opam\AppData\Local\opam\5.3\lib\zarith\zarith_version.cmx
- Installed C:\Users\opam\AppData\Local\opam\5.3\lib\zarith\zarith.cmxa
- Installed C:\Users\opam\AppData\Local\opam\5.3\lib\zarith\z.mli
- Installed C:\Users\opam\AppData\Local\opam\5.3\lib\zarith\zarith_top.cma
- Installed C:\Users\opam\AppData\Local\opam\5.3\lib\zarith\big_int_Z.cmi
- Installed C:\Users\opam\AppData\Local\opam\5.3\lib\zarith\q.cmi
- Installed C:\Users\opam\AppData\Local\opam\5.3\lib\zarith\z.cmi
- Installed C:\Users\opam\AppData\Local\opam\5.3\lib\zarith\libzarith.a
- Installed C:\Users\opam\AppData\Local\opam\5.3\lib\zarith\zarith.cma
- Installed C:\Users\opam\AppData\Local\opam\5.3\lib\stublibs\dllzarith.dll
- Installed C:\Users\opam\AppData\Local\opam\5.3\lib\stublibs\dllzarith.dll.owner
- ocamlfind: [WARNING] You have installed DLLs but the directory C:\Users\opam\AppData\Local\opam\5.3\lib\stublibs is not mentioned in ld.conf
- Installed C:\Users\opam\AppData\Local\opam\5.3\lib\zarith\META
-> installed zarith.1.14
Processing 327/352: [topkg: ocaml build]
Processing 328/352: [topkg: ocaml build]
Processing 329/352: [topkg: ocaml build]
+ C:\Users\opam\AppData\Local\opam\5.3\bin\ocaml.exe "pkg/pkg.ml" "build" "--pkg-name" "topkg" "--dev-pkg" "false" (CWD=C:\Users\opam\AppData\Local\opam\5.3\.opam-switch\build\topkg.1.0.7)
- + ocamlfind ocamldep -modules src/topkg.ml > src/topkg.ml.depends
- + ocamlfind ocamldep -modules src/topkg.mli > src/topkg.mli.depends
- + ocamlfind ocamlc -c -g -bin-annot -safe-string -I src -I test -I src-care -I src-bin -o src/topkg.cmi src/topkg.mli
- + ocamlfind ocamldep -modules src/topkg_build.ml > src/topkg_build.ml.depends
- + ocamlfind ocamldep -modules src/topkg_build.mli > src/topkg_build.mli.depends
- + ocamlfind ocamldep -modules src/topkg_cmd.mli > src/topkg_cmd.mli.depends
- + ocamlfind ocamldep -modules src/topkg_fpath.mli > src/topkg_fpath.mli.depends
- + ocamlfind ocamlc -c -g -bin-annot -safe-string -I src -I test -I src-care -I src-bin -o src/topkg_fpath.cmi src/topkg_fpath.mli
- + ocamlfind ocamldep -modules src/topkg_codec.mli > src/topkg_codec.mli.depends
- + ocamlfind ocamlc -c -g -bin-annot -safe-string -I src -I test -I src-care -I src-bin -o src/topkg_cmd.cmi src/topkg_cmd.mli
- + ocamlfind ocamldep -modules src/topkg_result.mli > src/topkg_result.mli.depends
- + ocamlfind ocamlc -c -g -bin-annot -safe-string -I src -I test -I src-care -I src-bin -o src/topkg_result.cmi src/topkg_result.mli
- + ocamlfind ocamldep -modules src/topkg_conf.mli > src/topkg_conf.mli.depends
- + ocamlfind ocamlc -c -g -bin-annot -safe-string -I src -I test -I src-care -I src-bin -o src/topkg_codec.cmi src/topkg_codec.mli
- + ocamlfind ocamlc -c -g -bin-annot -safe-string -I src -I test -I src-care -I src-bin -o src/topkg_conf.cmi src/topkg_conf.mli
- + ocamlfind ocamlc -c -g -bin-annot -safe-string -I src -I test -I src-care -I src-bin -o src/topkg_build.cmi src/topkg_build.mli
- + ocamlfind ocamldep -modules src/topkg_cmd.ml > src/topkg_cmd.ml.depends
- + ocamlfind ocamldep -modules src/topkg_fpath.ml > src/topkg_fpath.ml.depends
- + ocamlfind ocamldep -modules src/topkg_string.ml > src/topkg_string.ml.depends
- + ocamlfind ocamldep -modules src/topkg_string.mli > src/topkg_string.mli.depends
- + ocamlfind ocamlc -c -g -bin-annot -safe-string -I src -I test -I src-care -I src-bin -o src/topkg_string.cmi src/topkg_string.mli
- + ocamlfind ocamlopt -c -g -bin-annot -safe-string -I src -I test -I src-care -I src-bin -o src/topkg_string.cmx src/topkg_string.ml
- + ocamlfind ocamlopt -c -g -bin-annot -safe-string -I src -I test -I src-care -I src-bin -o src/topkg_fpath.cmx src/topkg_fpath.ml
- + ocamlfind ocamldep -modules src/topkg_codec.ml > src/topkg_codec.ml.depends
- + ocamlfind ocamlopt -c -g -bin-annot -safe-string -I src -I test -I src-care -I src-bin -o src/topkg_cmd.cmx src/topkg_cmd.ml
- + ocamlfind ocamldep -modules src/topkg_os.ml > src/topkg_os.ml.depends
- + ocamlfind ocamldep -modules src/topkg_os.mli > src/topkg_os.mli.depends
- + ocamlfind ocamlc -c -g -bin-annot -safe-string -I src -I test -I src-care -I src-bin -o src/topkg_os.cmi src/topkg_os.mli
- + ocamlfind ocamldep -modules src/topkg_log.ml > src/topkg_log.ml.depends
- + ocamlfind ocamldep -modules src/topkg_log.mli > src/topkg_log.mli.depends
- + ocamlfind ocamlc -c -g -bin-annot -safe-string -I src -I test -I src-care -I src-bin -o src/topkg_log.cmi src/topkg_log.mli
- + ocamlfind ocamldep -modules src/topkg_result.ml > src/topkg_result.ml.depends
- + ocamlfind ocamlopt -c -g -bin-annot -safe-string -I src -I test -I src-care -I src-bin -o src/topkg_result.cmx src/topkg_result.ml
- + ocamlfind ocamlopt -c -g -bin-annot -safe-string -I src -I test -I src-care -I src-bin -o src/topkg_log.cmx src/topkg_log.ml
- + ocamlfind ocamlopt -c -g -bin-annot -safe-string -I src -I test -I src-care -I src-bin -o src/topkg_os.cmx src/topkg_os.ml
- + ocamlfind ocamldep -modules src/topkg_conf.ml > src/topkg_conf.ml.depends
- + ocamlfind ocamlopt -c -g -bin-annot -safe-string -I src -I test -I src-care -I src-bin -o src/topkg_codec.cmx src/topkg_codec.ml
- + ocamlfind ocamldep -modules src/topkg_vcs.ml > src/topkg_vcs.ml.depends
- + ocamlfind ocamldep -modules src/topkg_vcs.mli > src/topkg_vcs.mli.depends
- + ocamlfind ocamlc -c -g -bin-annot -safe-string -I src -I test -I src-care -I src-bin -o src/topkg_vcs.cmi src/topkg_vcs.mli
- + ocamlfind ocamlopt -c -g -bin-annot -safe-string -I src -I test -I src-care -I src-bin -o src/topkg_vcs.cmx src/topkg_vcs.ml
- + ocamlfind ocamlopt -c -g -bin-annot -safe-string -I src -I test -I src-care -I src-bin -o src/topkg_conf.cmx src/topkg_conf.ml
- + ocamlfind ocamldep -modules src/topkg_distrib.ml > src/topkg_distrib.ml.depends
- + ocamlfind ocamldep -modules src/topkg_distrib.mli > src/topkg_distrib.mli.depends
- + ocamlfind ocamlc -c -g -bin-annot -safe-string -I src -I test -I src-care -I src-bin -o src/topkg_distrib.cmi src/topkg_distrib.mli
- + ocamlfind ocamldep -modules src/topkg_opam.ml > src/topkg_opam.ml.depends
- + ocamlfind ocamldep -modules src/topkg_opam.mli > src/topkg_opam.mli.depends
- + ocamlfind ocamlc -c -g -bin-annot -safe-string -I src -I test -I src-care -I src-bin -o src/topkg_opam.cmi src/topkg_opam.mli
- + ocamlfind ocamlopt -c -g -bin-annot -safe-string -I src -I test -I src-care -I src-bin -o src/topkg_opam.cmx src/topkg_opam.ml
- + ocamlfind ocamldep -modules src/topkg_fexts.ml > src/topkg_fexts.ml.depends
- + ocamlfind ocamldep -modules src/topkg_fexts.mli > src/topkg_fexts.mli.depends
- + ocamlfind ocamlc -c -g -bin-annot -safe-string -I src -I test -I src-care -I src-bin -o src/topkg_fexts.cmi src/topkg_fexts.mli
- + ocamlfind ocamldep -modules src/topkg_install.ml > src/topkg_install.ml.depends
- + ocamlfind ocamldep -modules src/topkg_install.mli > src/topkg_install.mli.depends
- + ocamlfind ocamldep -modules src/topkg_test.mli > src/topkg_test.mli.depends
- + ocamlfind ocamlc -c -g -bin-annot -safe-string -I src -I test -I src-care -I src-bin -o src/topkg_test.cmi src/topkg_test.mli
- + ocamlfind ocamlc -c -g -bin-annot -safe-string -I src -I test -I src-care -I src-bin -o src/topkg_install.cmi src/topkg_install.mli
- + ocamlfind ocamlopt -c -g -bin-annot -safe-string -I src -I test -I src-care -I src-bin -o src/topkg_fexts.cmx src/topkg_fexts.ml
- + ocamlfind ocamldep -modules src/topkg_test.ml > src/topkg_test.ml.depends
- + ocamlfind ocamlopt -c -g -bin-annot -safe-string -I src -I test -I src-care -I src-bin -o src/topkg_test.cmx src/topkg_test.ml
- + ocamlfind ocamldep -modules src/topkg_ipc.ml > src/topkg_ipc.ml.depends
- + ocamlfind ocamldep -modules src/topkg_ipc.mli > src/topkg_ipc.mli.depends
- + ocamlfind ocamldep -modules src/topkg_pkg.mli > src/topkg_pkg.mli.depends
- + ocamlfind ocamldep -modules src/topkg_publish.mli > src/topkg_publish.mli.depends
- + ocamlfind ocamlc -c -g -bin-annot -safe-string -I src -I test -I src-care -I src-bin -o src/topkg_publish.cmi src/topkg_publish.mli
- + ocamlfind ocamlc -c -g -bin-annot -safe-string -I src -I test -I src-care -I src-bin -o src/topkg_pkg.cmi src/topkg_pkg.mli
- + ocamlfind ocamlc -c -g -bin-annot -safe-string -I src -I test -I src-care -I src-bin -o src/topkg_ipc.cmi src/topkg_ipc.mli
- + ocamlfind ocamldep -modules src/topkg_pkg.ml > src/topkg_pkg.ml.depends
- + ocamlfind ocamlopt -c -g -bin-annot -safe-string -I src -I test -I src-care -I src-bin -o src/topkg_build.cmx src/topkg_build.ml
- + ocamlfind ocamlopt -c -g -bin-annot -safe-string -I src -I test -I src-care -I src-bin -o src/topkg_distrib.cmx src/topkg_distrib.ml
- + ocamlfind ocamlopt -c -g -bin-annot -safe-string -I src -I test -I src-care -I src-bin -o src/topkg_install.cmx src/topkg_install.ml
- + ocamlfind ocamldep -modules src/topkg_publish.ml > src/topkg_publish.ml.depends
- + ocamlfind ocamlopt -c -g -bin-annot -safe-string -I src -I test -I src-care -I src-bin -o src/topkg_publish.cmx src/topkg_publish.ml
- + ocamlfind ocamlopt -c -g -bin-annot -safe-string -I src -I test -I src-care -I src-bin -o src/topkg_pkg.cmx src/topkg_pkg.ml
- + ocamlfind ocamldep -modules src/topkg_main.ml > src/topkg_main.ml.depends
- + ocamlfind ocamldep -modules src/topkg_main.mli > src/topkg_main.mli.depends
- + ocamlfind ocamlc -c -g -bin-annot -safe-string -I src -I test -I src-care -I src-bin -o src/topkg_main.cmi src/topkg_main.mli
- + ocamlfind ocamlopt -c -g -bin-annot -safe-string -I src -I test -I src-care -I src-bin -o src/topkg_ipc.cmx src/topkg_ipc.ml
- + ocamlfind ocamlopt -c -g -bin-annot -safe-string -I src -I test -I src-care -I src-bin -o src/topkg_main.cmx src/topkg_main.ml
- + ocamlfind ocamlopt -c -g -bin-annot -safe-string -I src -I test -I src-care -I src-bin -o src/topkg.cmx src/topkg.ml
- + ocamlfind ocamlopt -a -I src src/topkg_string.cmx src/topkg_fpath.cmx src/topkg_cmd.cmx src/topkg_result.cmx src/topkg_log.cmx src/topkg_os.cmx src/topkg_codec.cmx src/topkg_vcs.cmx src/topkg_conf.cmx src/topkg_build.cmx src/topkg_opam.cmx src/topkg_distrib.cmx src/topkg_fexts.cmx src/topkg_test.cmx src/topkg_install.cmx src/topkg_publish.cmx src/topkg_pkg.cmx src/topkg_ipc.cmx src/topkg_main.cmx src/topkg.cmx -o src/topkg.cmxa
- + ocamlfind ocamlopt -shared -linkall -I src src/topkg.cmxa -o src/topkg.cmxs
- + ocamlfind ocamlc -c -g -bin-annot -safe-string -I src -I test -I src-care -I src-bin -o src/topkg.cmo src/topkg.ml
- + ocamlfind ocamlc -c -g -bin-annot -safe-string -I src -I test -I src-care -I src-bin -o src/topkg_build.cmo src/topkg_build.ml
- + ocamlfind ocamlc -c -g -bin-annot -safe-string -I src -I test -I src-care -I src-bin -o src/topkg_cmd.cmo src/topkg_cmd.ml
- + ocamlfind ocamlc -c -g -bin-annot -safe-string -I src -I test -I src-care -I src-bin -o src/topkg_codec.cmo src/topkg_codec.ml
- + ocamlfind ocamlc -c -g -bin-annot -safe-string -I src -I test -I src-care -I src-bin -o src/topkg_conf.cmo src/topkg_conf.ml
- + ocamlfind ocamlc -c -g -bin-annot -safe-string -I src -I test -I src-care -I src-bin -o src/topkg_distrib.cmo src/topkg_distrib.ml
- + ocamlfind ocamlc -c -g -bin-annot -safe-string -I src -I test -I src-care -I src-bin -o src/topkg_fexts.cmo src/topkg_fexts.ml
- + ocamlfind ocamlc -c -g -bin-annot -safe-string -I src -I test -I src-care -I src-bin -o src/topkg_fpath.cmo src/topkg_fpath.ml
- + ocamlfind ocamlc -c -g -bin-annot -safe-string -I src -I test -I src-care -I src-bin -o src/topkg_install.cmo src/topkg_install.ml
- + ocamlfind ocamlc -c -g -bin-annot -safe-string -I src -I test -I src-care -I src-bin -o src/topkg_ipc.cmo src/topkg_ipc.ml
- + ocamlfind ocamlc -c -g -bin-annot -safe-string -I src -I test -I src-care -I src-bin -o src/topkg_log.cmo src/topkg_log.ml
- + ocamlfind ocamlc -c -g -bin-annot -safe-string -I src -I test -I src-care -I src-bin -o src/topkg_main.cmo src/topkg_main.ml
- + ocamlfind ocamlc -c -g -bin-annot -safe-string -I src -I test -I src-care -I src-bin -o src/topkg_opam.cmo src/topkg_opam.ml
- + ocamlfind ocamlc -c -g -bin-annot -safe-string -I src -I test -I src-care -I src-bin -o src/topkg_os.cmo src/topkg_os.ml
- + ocamlfind ocamlc -c -g -bin-annot -safe-string -I src -I test -I src-care -I src-bin -o src/topkg_pkg.cmo src/topkg_pkg.ml
- + ocamlfind ocamlc -c -g -bin-annot -safe-string -I src -I test -I src-care -I src-bin -o src/topkg_publish.cmo src/topkg_publish.ml
- + ocamlfind ocamlc -c -g -bin-annot -safe-string -I src -I test -I src-care -I src-bin -o src/topkg_result.cmo src/topkg_result.ml
- + ocamlfind ocamlc -c -g -bin-annot -safe-string -I src -I test -I src-care -I src-bin -o src/topkg_string.cmo src/topkg_string.ml
- + ocamlfind ocamlc -c -g -bin-annot -safe-string -I src -I test -I src-care -I src-bin -o src/topkg_test.cmo src/topkg_test.ml
- + ocamlfind ocamlc -c -g -bin-annot -safe-string -I src -I test -I src-care -I src-bin -o src/topkg_vcs.cmo src/topkg_vcs.ml
- + ocamlfind ocamlc -a -I src src/topkg_string.cmo src/topkg_fpath.cmo src/topkg_cmd.cmo src/topkg_result.cmo src/topkg_log.cmo src/topkg_os.cmo src/topkg_codec.cmo src/topkg_vcs.cmo src/topkg_conf.cmo src/topkg_build.cmo src/topkg_opam.cmo src/topkg_distrib.cmo src/topkg_fexts.cmo src/topkg_test.cmo src/topkg_install.cmo src/topkg_publish.cmo src/topkg_pkg.cmo src/topkg_ipc.cmo src/topkg_main.cmo src/topkg.cmo -o src/topkg.cma
- # Parallel statistics: { count(total): 2(84), max: 20, min: 2, average(total): 11.000(1.238) }
-> compiled  topkg.1.0.7
-> installed topkg.1.0.7
Processing 331/352: [fmt: ocaml build]
Processing 332/352: [fmt: ocaml build] [uutf: ocaml build]
+ C:\Users\opam\AppData\Local\opam\5.3\bin\ocaml.exe "pkg/pkg.ml" "build" "--dev-pkg" "false" "--with-cmdliner" "false" (CWD=C:\Users\opam\AppData\Local\opam\5.3\.opam-switch\build\uutf.1.0.3)
- + ocamlfind ocamldep -modules src/uutf.ml > src/uutf.ml.depends
- + ocamlfind ocamldep -modules src/uutf.mli > src/uutf.mli.depends
- + ocamlfind ocamlc -c -g -bin-annot -safe-string -I src -I test -o src/uutf.cmi src/uutf.mli
- + ocamlfind ocamlopt -c -g -bin-annot -safe-string -I src -I test -o src/uutf.cmx src/uutf.ml
- + ocamlfind ocamlopt -a -I src src/uutf.cmx -o src/uutf.cmxa
- + ocamlfind ocamlopt -shared -linkall -I src src/uutf.cmxa -o src/uutf.cmxs
- + ocamlfind ocamlc -c -g -bin-annot -safe-string -I src -I test -o src/uutf.cmo src/uutf.ml
- + ocamlfind ocamlc -a -I src src/uutf.cmo -o src/uutf.cma
- # No parallelism done
-> compiled  uutf.1.0.3
Processing 332/352: [fmt: ocaml build]
-> installed uutf.1.0.3
Processing 333/352: [fmt: ocaml build]
Processing 334/352: [fmt: ocaml build]
Processing 335/352: [fmt: ocaml build]
+ C:\Users\opam\AppData\Local\opam\5.3\bin\ocaml.exe "pkg/pkg.ml" "build" "--dev-pkg" "false" "--with-base-unix" "true" "--with-cmdliner" "false" (CWD=C:\Users\opam\AppData\Local\opam\5.3\.opam-switch\build\fmt.0.9.0)
- + ocamlfind ocamldep -modules src/fmt.ml > src/fmt.ml.depends
- + ocamlfind ocamldep -modules src/fmt.mli > src/fmt.mli.depends
- + ocamlfind ocamlc -c -g -bin-annot -safe-string -I src -I test -o src/fmt.cmi src/fmt.mli
- + ocamlfind ocamlopt -c -g -bin-annot -safe-string -I src -I test -o src/fmt.cmx src/fmt.ml
- + ocamlfind ocamlopt -a -I src src/fmt.cmx -o src/fmt.cmxa
- + ocamlfind ocamlopt -shared -linkall -I src src/fmt.cmxa -o src/fmt.cmxs
- + ocamlfind ocamlc -c -g -bin-annot -safe-string -I src -I test -o src/fmt.cmo src/fmt.ml
- + ocamlfind ocamlc -a -I src src/fmt.cmo -o src/fmt.cma
- + ocamlfind ocamldep -package unix -modules src/fmt_tty.ml > src/fmt_tty.ml.depends
- + ocamlfind ocamldep -package unix -modules src/fmt_tty.mli > src/fmt_tty.mli.depends
- + ocamlfind ocamlc -c -g -bin-annot -safe-string -package unix -I src -I test -o src/fmt_tty.cmi src/fmt_tty.mli
- + ocamlfind ocamlopt -c -g -bin-annot -safe-string -package unix -I src -I test -o src/fmt_tty.cmx src/fmt_tty.ml
- + ocamlfind ocamlopt -c -g -bin-annot -safe-string -package unix -I src -I test -o src/fmt_tty.cmx src/fmt_tty.ml
- File "src/fmt_tty.ml", line 49, characters 12-20:
- 49 |         try is_infix "UTF-8" (String.uppercase_ascii (Sys.getenv var))
-                  ^^^^^^^^
- Warning 6 [labels-omitted]: label affix was omitted in the application of this function.
- + ocamlfind ocamlopt -a -package unix -I src src/fmt_tty.cmx -o src/fmt_tty.cmxa
- + ocamlfind ocamlopt -shared -linkall -package unix -I src src/fmt_tty.cmxa -o src/fmt_tty.cmxs
- + ocamlfind ocamlc -c -g -bin-annot -safe-string -package unix -I src -I test -o src/fmt_tty.cmo src/fmt_tty.ml
- + ocamlfind ocamlc -c -g -bin-annot -safe-string -package unix -I src -I test -o src/fmt_tty.cmo src/fmt_tty.ml
- File "src/fmt_tty.ml", line 49, characters 12-20:
- 49 |         try is_infix "UTF-8" (String.uppercase_ascii (Sys.getenv var))
-                  ^^^^^^^^
- Warning 6 [labels-omitted]: label affix was omitted in the application of this function.
- + ocamlfind ocamlc -a -package unix -I src src/fmt_tty.cmo -o src/fmt_tty.cma
- + ocamlfind ocamldep -package compiler-libs.toplevel -modules src/fmt_top.ml > src/fmt_top.ml.depends
- + ocamlfind ocamlc -c -g -bin-annot -safe-string -package compiler-libs.toplevel -I src -I test -o src/fmt_top.cmo src/fmt_top.ml
- + ocamlfind ocamlopt -c -g -bin-annot -safe-string -package compiler-libs.toplevel -I src -I test -o src/fmt_top.cmx src/fmt_top.ml
- + ocamlfind ocamlopt -a -package compiler-libs.toplevel -I src src/fmt_top.cmx -o src/fmt_top.cmxa
- + ocamlfind ocamlopt -shared -linkall -package compiler-libs.toplevel -I src src/fmt_top.cmxa -o src/fmt_top.cmxs
- + ocamlfind ocamlc -a -package compiler-libs.toplevel -I src src/fmt_top.cmo -o src/fmt_top.cma
- # No parallelism done
-> compiled  fmt.0.9.0
-> installed fmt.0.9.0

#=== ERROR while compiling dune.3.17.1 ========================================#
# context              2.3.0~beta1 | win32/x86_64 | ocaml-base-compiler.5.3.0 | file://C:/Users/opam/opam-repository
# path                 ~\AppData\Local\opam\5.3\.opam-switch\build\dune.3.17.1
# command              ~\AppData\Local\opam\5.3\bin\ocaml.exe boot/bootstrap.ml -j 15
# exit-code            2
# env-file             ~\AppData\Local\opam\log\dune-1656-053da4.env
# output-file          ~\AppData\Local\opam\log\dune-1656-053da4.out
### output ###
# ocamlc -output-complete-exe -w -24 -g -o .duneboot.exe -I boot -I +unix unix.cma boot/libs.ml boot/duneboot.ml
# .\.duneboot.exe -j 15
# cd _boot && C:\Users\opam\AppData\Local\opam\5.3\bin\ocamlopt.opt.exe -c -g -no-alias-deps -w -49-6 -alert -unstable -I +unix -I +threads ocamlc_loc.mli
# File "otherlibs/ocamlc-loc/src\\ocamlc_loc.mli", line 1, characters 4-9:

# Warning 53 [misplaced-attribute]: the "alert" attribute cannot appear in this context

# cd _boot && C:\Users\opam\AppData\Local\opam\5.3\bin\ocamlopt.opt.exe -c -g -no-alias-deps -w -49-6 -alert -unstable -I +unix -I +threads dune_re__Color_map.ml
# x86_64-w64-mingw32-gcc: fatal error: cannot execute 'as': spawn: No such file or directory
# compilation terminated.
# File "dune_re__Color_map.ml", line 1:

# Error: Assembler error, input left in file "C:\Users\opam\AppData\Local\Temp\camlasmb9b499.s"

# 





<><> Error report <><><><><><><><><><><><><><><><><><><><><><><><><><><><><><><>
+- The following actions were aborted
| - install async                       v0.17.0
| - install async_kernel                v0.17.0
| - install async_log                   v0.17.0
| - install async_rpc_kernel            v0.17.0
| - install async_ssl                   v0.17.0-1
| - install async_unix                  v0.17.0
| - install async_websocket             v0.17.0
| - install base                        v0.17.1
| - install base_bigstring              v0.17.0
| - install base_quickcheck             v0.17.0
| - install bigarray-compat             1.1.0
| - install bin_prot                    v0.17.0
| - install capitalization              v0.17.0
| - install core                        v0.17.1
| - install core_kernel                 v0.17.0
| - install core_unix                   v0.17.0
| - install cryptokit                   1.16.1
| - install csexp                       1.5.2
| - install cstruct                     6.2.0
| - install ctypes                      0.23.0
| - install ctypes-foreign              0.23.0
| - install dune-configurator           3.17.1
| - install expect_test_helpers_core    v0.17.0
| - install fieldslib                   v0.17.0
| - install gel                         v0.17.0
| - install int_repr                    v0.17.0
| - install integers                    0.7.0
| - install jane-street-headers         v0.17.0
| - install jane_rope                   v0.17.0
| - install jst-config                  v0.17.0
| - install ocaml-compiler-libs         v0.17.0
| - install ocaml_intrinsics_kernel     v0.17.1
| - install parsexp                     v0.17.0
| - install ppx_assert                  v0.17.0
| - install ppx_base                    v0.17.0
| - install ppx_bench                   v0.17.0
| - install ppx_bin_prot                v0.17.0
| - install ppx_cold                    v0.17.0
| - install ppx_compare                 v0.17.0
| - install ppx_custom_printf           v0.17.0
| - install ppx_derivers                1.2.1
| - install ppx_diff                    v0.17.0
| - install ppx_disable_unused_warnings v0.17.0
| - install ppx_enumerate               v0.17.0
| - install ppx_expect                  v0.17.2
| - install ppx_fields_conv             v0.17.0
| - install ppx_fixed_literal           v0.17.0
| - install ppx_globalize               v0.17.0
| - install ppx_hash                    v0.17.0
| - install ppx_here                    v0.17.0
| - install ppx_ignore_instrumentation  v0.17.0
| - install ppx_inline_test             v0.17.0
| - install ppx_jane                    v0.17.0
| - install ppx_let                     v0.17.0
| - install ppx_log                     v0.17.0
| - install ppx_module_timer            v0.17.0
| - install ppx_optcomp                 v0.17.0
| - install ppx_optional                v0.17.0
| - install ppx_pipebang                v0.17.0
| - install ppx_sexp_conv               v0.17.0
| - install ppx_sexp_message            v0.17.0
| - install ppx_sexp_value              v0.17.0
| - install ppx_stable                  v0.17.0
| - install ppx_stable_witness          v0.17.0
| - install ppx_string                  v0.17.0
| - install ppx_string_conv             v0.17.0
| - install ppx_tydi                    v0.17.0
| - install ppx_typerep_conv            v0.17.0
| - install ppx_variants_conv           v0.17.0
| - install ppxlib                      0.34.0
| - install ppxlib_jane                 v0.17.2
| - install protocol_version_header     v0.17.0
| - install re                          1.12.0
| - install re2                         v0.17.0
| - install regex_parser_intf           v0.17.0
| - install sexp_pretty                 v0.17.0
| - install sexplib                     v0.17.0
| - install sexplib0                    v0.17.0
| - install shuttle_http                0.12.0
| - install shuttle_websocket           0.12.0
| - install spawn                       v0.17.0
| - install splittable_random           v0.17.0
| - install stdio                       v0.17.0
| - install stdlib-shims                0.3.0
| - install textutils                   v0.17.0
| - install time_now                    v0.17.0
| - install timezone                    v0.17.0
| - install typerep                     v0.17.1
| - install uopt                        v0.17.0
| - install variantslib                 v0.17.0
+- 
+- The following actions failed
| - build dune 3.17.1
+- 
+- The following changes have been performed (the rest was aborted)
| - recompile mingw-w64-shims               0.2.0
| - install   conf-g++                      1.0
| - install   conf-gmp                      4
| - install   conf-gmp-powm-sec             3
| - install   conf-libffi                   2.0.0
| - install   conf-libssl                   4
| - install   conf-mingw-w64-g++-i686       1
| - install   conf-mingw-w64-g++-x86_64     1
| - install   conf-mingw-w64-gcc-i686       1
| - install   conf-mingw-w64-gmp-i686       1
| - install   conf-mingw-w64-gmp-x86_64     1
| - install   conf-mingw-w64-libffi-i686    1
| - install   conf-mingw-w64-libffi-x86_64  1
| - install   conf-mingw-w64-openssl-i686   1
| - install   conf-mingw-w64-openssl-x86_64 1
| - install   conf-mingw-w64-zlib-i686      1
| - install   conf-mingw-w64-zlib-x86_64    1
| - install   conf-pkg-config               3
| - install   conf-zlib                     1
| - install   fmt                           0.9.0
| - install   num                           1.5-1
| - install   ocamlbuild                    0.15.0
| - install   ocamlfind                     1.9.5
| - install   seq                           base
| - install   topkg                         1.0.7
| - install   uutf                          1.0.3
| - install   zarith                        1.14
+- 
# To update the current shell environment, run: eval $(opam env)

The former state can be restored with:
    C:\cygwin64\bin\opam.exe switch import "C:\\Users\\opam\\AppData\\Local\\opam\\5.3\\.opam-switch\\backup\\state-20250326000519.export"
'C:\cygwin64\bin\opam.exe install -vy shuttle_websocket.0.12.0' failed.
"opam remove -y shuttle_websocket.0.12.0
opam install -vy shuttle_websocket.0.12.0
res=$?
if [ $res = 31 ]; then
    if opam show -f x-ci-accept-failures: shuttle_websocket.0.12.0 | grep -q 'windows-server-2022-amd64-ocaml-5.3'; then
        echo "This package failed and has been disabled for CI using the 'x-ci-accept-failures' field."
        exit 69
    fi
fi 


exit $res" failed with exit status 31
Failed: Build failed